Azuleno[2,1,8-ija]azulene

Gas phase ion energetics data

Data compiled by: Sharon G. Lias, Rhoda D. Levin, and Sherif A. Kafafi

Ionization energy determinations

IE (eV) Method Reference Comment
7.14 ± 0.03PEBatich, Heilbronner, et al., 1974Vertical value

Gas phase thermochemistry data

Data compiled by: Hussein Y. Afeefy, Joel F. Liebman, and Stephen E. Stein

Quantity Value Units Method Reference Comment
Δfgas131.4kcal/molChydRoth, Adamczak, et al., 1991

References

Batich, Heilbronner, et al., 1974
Batich, C.; Heilbronner, E.; Vogel, E., The ionization energies of bridged [14]annulenes and of dicyclohepta[cd,gh]pentalene, Helv. Chim. Acta, 1974, 57, 2288. [all data]