N,N'-1,6-hexanediylbis(butanamide)

Phase change data

Data compiled by: Thermodynamics Research Center, NIST Boulder Laboratories, Chris Muzny director

Quantity Value Units Method Reference Comment
Tfus420.KN/ACarfagna, Vacatello, et al., 1979Crystal phase 1 phase; Uncertainty assigned by TRC = 1. K

In addition to the Thermodynamics Research Center (TRC) data available from this site, much more physical and chemical property data is available from the following TRC products:

References

Carfagna, Vacatello, et al., 1979
Carfagna, C.; Vacatello, M.; Corradini, P., Melting behavior of a series of diamides., Thermochim. Acta, 1979, 28, 265. [all data]