4-Pyridinamine, 2,6-dimethyl-

Phase change data

Data compiled by: Robert L. Brown and Stephen E. Stein

Quantity Value Units Method Reference Comment
Tboil519.2KN/AWeast and Grasselli, 1989
Tboil519.KN/ABuckingham and Donaghy, 1982
Quantity Value Units Method Reference Comment
Tfus459.KN/ABuckingham and Donaghy, 1982

References

Weast and Grasselli, 1989
CRC Handbook of Data on Organic Compounds, 2nd Editon, Weast,R.C and Grasselli, J.G., ed(s)., CRC Press, Inc., Boca Raton, FL, 1989, 1. [all data]

Buckingham and Donaghy, 1982
Buckingham, J.; Donaghy, S.M., Dictionary of Organic Compounds: Fifth Edition, Chapman and Hall, New York, 1982, 1. [all data]