Ethanone, 1-(3-pyridinyl)-

Gas phase ion energetics data

Data evaluated as indicated in comments:
HL - Edward P. Hunter and Sharon G. Lias

Data compiled as indicated in comments:
LLK - Sharon G. Lias, Rhoda D. Levin, and Sherif A. Kafafi

Quantity Value Units Method Reference Comment
Proton affinity (review)916.2kJ/molN/AHunter and Lias, 1998HL
Quantity Value Units Method Reference Comment
Gas basicity884.3kJ/molN/AHunter and Lias, 1998HL

Ionization energy determinations

IE (eV) Method Reference Comment
9.1PEModelli and Distefano, 1981LLK
9.57PEModelli and Distefano, 1981Vertical value; LLK

Van Den Dool and Kratz RI, non-polar column, temperature ramp

Data compiled by: NIST Mass Spectrometry Data Center, William E. Wallace, director

Column type Capillary
Active phase DB-5
Column length (m) 30.
Carrier gas He
Substrate
Column diameter (mm) 0.25
Phase thickness (μm) 1.
Tstart (C) 50.
Tend (C) 200.
Heat rate (K/min) 2.5
Initial hold (min)
Final hold (min)
I 1117.
ReferenceDallüge, van Stee, et al., 2002
Comment MSDC-RI

References

Hunter and Lias, 1998
Hunter, E.P.; Lias, S.G., Evaluated Gas Phase Basicities and Proton Affinities of Molecules: An Update, J. Phys. Chem. Ref. Data, 1998, 27, 3, 413-656, https://doi.org/10.1063/1.556018 . [all data]

Modelli and Distefano, 1981
Modelli, A.; Distefano, G., He(I) photoelectron spectra of chloro-, vinyl- and acetyl-pyridines, J. Electron Spectrosc. Relat. Phenom., 1981, 23, 323. [all data]