1,1'-Biphenyl, 2,5-dichloro-

Phase change data

Data compiled as indicated in comments:
BS - Robert L. Brown and Stephen E. Stein
AC - William E. Acree, Jr., James S. Chickos

Quantity Value Units Method Reference Comment
Δvap76.8 ± 0.4kJ/molCGCPuri, Chickos, et al., 2001AC

Reduced pressure boiling point

Tboil (K) Pressure (bar) Reference Comment
444.20.020Weast and Grasselli, 1989BS

Enthalpy of vaporization

ΔvapH (kJ/mol) Temperature (K) Method Reference Comment
73.9368.GCFalconer and Bidleman, 1994Based on data from 343. - 393. K.; AC

Kovats' RI, non-polar column, isothermal

View large format table.

Column type Active phase Temperature (C) I Reference Comment
PackedOV-101200.1656.Albro, Haseman, et al., 1977Chromosorb W HP (80-100 mesh); Column length: 3. m
CapillaryOV-101150.1637.Zell, Neu, et al., 1977Column length: 27. m
CapillaryOV-101150.1637.Zell, Neu, et al., 1977Column length: 27. m

Normal alkane RI, non-polar column, temperature ramp

View large format table.

Column type Active phase I Reference Comment
CapillaryHP-51672.Zenkevich, Moeder, et al., 200430. m/0.25 mm/0.25 μm, Helium, 50. C @ 3. min, 3. K/min, 280. C @ 20. min
CapillarySPB-11628.Nakano, Tsuji, et al., 198730. m/0.25 mm/0.25 μm, 4. K/min; Tstart: 130. C; Tend: 280. C

Normal alkane RI, non-polar column, custom temperature program

View large format table.

Column type Active phase I Reference Comment
CapillaryApolane1635.Bush, Murphy, et al., 1985He; Column length: 50. m; Column diameter: 0.25 mm; Program: 70 0C (2 min) 10 0C/min (6 min) 2 0C/min -> 250 0C
CapillaryApolane1635.Bush, Murphy, et al., 1985He; Column length: 50. m; Column diameter: 0.25 mm; Program: 70 0C (2 min) 10 0C/min (6 min) 2 0C/min -> 250 0C

References

Puri, Chickos, et al., 2001
Puri, Swati; Chickos, James S.; Welsh, William J., Determination of Vaporization Enthalpies of Polychlorinated Biphenyls by Correlation Gas Chromatography, Anal. Chem., 2001, 73, 7, 1480-1484, https://doi.org/10.1021/ac001246p . [all data]

Weast and Grasselli, 1989
CRC Handbook of Data on Organic Compounds, 2nd Editon, Weast,R.C and Grasselli, J.G., ed(s)., CRC Press, Inc., Boca Raton, FL, 1989, 1. [all data]

Falconer and Bidleman, 1994
Falconer, Renee L.; Bidleman, Terry F., Vapor pressures and predicted particle/gas distributions of polychlorinated biphenyl congeners as functions of temperature and ortho-chlorine substitution, Atmospheric Environment, 1994, 28, 3, 547-554, https://doi.org/10.1016/1352-2310(94)90130-9 . [all data]