1H-1,2,3-Triazolium, 4-mercapto-1,3-dimethyl-, hydroxide, inner salt

Gas phase ion energetics data

Data compiled by: Sharon G. Lias, Rhoda D. Levin, and Sherif A. Kafafi

Ionization energy determinations

IE (eV) Method Reference Comment
7.25PEGuimon, Pfister-Guillouzo, et al., 1978Vertical value

References

Guimon, Pfister-Guillouzo, et al., 1978
Guimon, C.; Pfister-Guillouzo, G.; Begtrup, M., Photoelectron spectra of some pyrazolthiones, 1,2,3-triazolthiones, and 4-(1,2,3-triazolio) sulfides. Evidence of an abnormal effect of methylation, J. Am. Chem. Soc., 1978, 100, 1275. [all data]