(Z)-Cyclopentadecene

Gas phase ion energetics data

Data compiled by: Sharon G. Lias, Rhoda D. Levin, and Sherif A. Kafafi

Ionization energy determinations

IE (eV) Method Reference
8.80 ± 0.15EIRemane, Graefe, et al., 1972

References

Remane, Graefe, et al., 1972
Remane, H.; Graefe, J.; Herzschuh, R., Ionisationspotentiale von cis- und trans-Cycloalkenen, Z. Chem., 1972, 12, 194. [all data]