3-Butene-2-one-4-ol, 1,4-diphenyl-

Gas phase ion energetics data

Data compiled by: Sharon G. Lias and Joel F. Liebman

Ionization energy determinations

IE (eV) Method Reference
8.36EIOrlov, Rashkes, et al., 1988

Appearance energy determinations

Ion AE (eV) Other Products MethodReferenceComment
C8H7O+9.83C6H5COCH2EIOrlov, Rashkes, et al., 1988

References

Orlov, Rashkes, et al., 1988
Orlov, V.M.; Rashkes, Y.V.; Siretskaya, T.V.; Takhistov, V.V., Thermochemical description of tutomeric transformations in ionized 1,3-diketones, J. Gen. Chem. USSR, 1988, 58, 374. [all data]