Pyrimidine, 4-phenyl-

Gas phase ion energetics data

Data compiled as indicated in comments:
LBLHLM - Sharon G. Lias, John E. Bartmess, Joel F. Liebman, John L. Holmes, Rhoda D. Levin, and W. Gary Mallard

Ionization energy determinations

IE (eV) Method Reference Comment
8.65PEBarone, Cauletti, et al., 1984LBLHLM
9.42PEBarone, Cauletti, et al., 1984Vertical value; LBLHLM

References

Barone, Cauletti, et al., 1984
Barone, V.; Cauletti, C.; Commisso, L.; Lelj, F.; Piancastelli, M.N.; Russo, N., Quantum-mechanical and ultraviolet photoelectron spectroscopic studies of azabiphenyls. The case of 4-phenylpyridine, J. Chem. Res. Synop., 1984, 338. [all data]