Cyclopropane, 1-methyl-1-isopropenyl-

Gas phase ion energetics data

Data compiled by: Sharon G. Lias and Joel F. Liebman

Ionization energy determinations

IE (eV) Method Reference Comment
9.03PEPlemenkov, Zverev, et al., 1989Vertical value

References

Plemenkov, Zverev, et al., 1989
Plemenkov, V.V.; Zverev, V.V.; Vakar, V.M.; Ermolaeva, L.V.; Ignatchenko, A.V.; Tserevitinov, B.O.; Bolesov, I.G., Photoelectric spectra, orbital interactions, and conformations in 1-alkenyl-1-methylcyclopropanes and 3-alkenyl-3-methylcyclopropenes, J. Gen. Chem. USSR, 1989, 59, 874. [all data]