Trisulfide, methyl 2-propenyl

Van Den Dool and Kratz RI, non-polar column, custom temperature program

Data compiled by: NIST Mass Spectrometry Data Center, William E. Wallace, director

Column type CapillaryCapillary
Active phase HP-5MSSPB-1
Column length (m) 30.30.
Carrier gas HeN2
Substrate
Column diameter (mm) 0.250.32
Phase thickness (μm) 0.254.0
Program 60C (1 min) => 5 C/min => 210C => 10 C/min => 280C (15 min)40 0C (10 min), 2 0C/min to 180 0C, 25 0C/min to 250 0C (5 min)
I 1143.81116.
ReferenceAndriamaharavo, 2014Mochizuki, Yamamoto, et al., 1998
Comment MSDC-RI MSDC-RI

Normal alkane RI, non-polar column, temperature ramp

Data compiled by: NIST Mass Spectrometry Data Center, William E. Wallace, director

Column type CapillaryCapillaryCapillaryCapillary
Active phase SPB-1RSL-200DB-5MSHP-1
Column length (m) 30.30.30.25.
Carrier gas HeliumH2HeH2
Substrate
Column diameter (mm) 0.320.320.250.32
Phase thickness (μm) 0.250.250.250.17
Tstart (C) 40.50.60.40.
Tend (C) 220.280.270.200.
Heat rate (K/min) 2.6.3.5.
Initial hold (min) 2.5.
Final hold (min)  5.
I 1110.1124.1135.1100.
ReferenceRao, Nagender, et al., 2007Jirovetz, Ngassoum, et al., 2002Zoghbi, Andrade, et al., 2002Lopes, Godoy, et al., 1997
Comment MSDC-RI MSDC-RI MSDC-RI MSDC-RI

References

Andriamaharavo, 2014
Andriamaharavo, N.R., Retention Data. NIST Mass Spectrometry Data Center., NIST Mass Spectrometry Data Center, 2014. [all data]

Mochizuki, Yamamoto, et al., 1998
Mochizuki, E.; Yamamoto, T.; Komiyama, Y.; Nakazawa, H., Identification of allium products using flame photometric detection gas chromatography and distribution patterns of volatile sulfur compounds, J. Agric. Food Chem., 1998, 46, 12, 5170-5176, https://doi.org/10.1021/jf9803076 . [all data]