2H-Pyran-3(4H)-one, 6-ethenyldihydro-2,2,6-trimethyl-

Normal alkane RI, non-polar column, temperature ramp

Data compiled by: NIST Mass Spectrometry Data Center, William E. Wallace, director

Column type Capillary
Active phase HP-5MS
Column length (m) 30.
Carrier gas He
Substrate
Column diameter (mm) 0.25
Phase thickness (μm) 0.25
Tstart (C) 60.
Tend (C) 275.
Heat rate (K/min) 4.
Initial hold (min)
Final hold (min)
I 1109.
ReferenceAfsharypuor and Jahromy, 2003
Comment MSDC-RI

References

Afsharypuor and Jahromy, 2003
Afsharypuor, S.; Jahromy, M.M., Constituents of the essential oil from Tanacetum lingulatum (Boiss.) Bornm., J. Essent. Oil Res., 2003, 15, 2, 74-76, https://doi.org/10.1080/10412905.2003.9712069 . [all data]