1-Monobenzoylglycerol

Condensed phase thermochemistry data

Data compiled as indicated in comments:
ALS - Hussein Y. Afeefy, Joel F. Liebman, and Stephen E. Stein
DH - Eugene S. Domalski and Elizabeth D. Hearing

Quantity Value Units Method Reference Comment
Δfsolid-777.4 ± 1.2kJ/molCcbSilbert, Daubert, et al., 1965ALS
Quantity Value Units Method Reference Comment
Δcsolid-4872.7 ± 1.1kJ/molCcbSilbert, Daubert, et al., 1965Corresponding Δfsolid = -777.35 kJ/mol (simple calculation by NIST; no Washburn corrections); ALS

Constant pressure heat capacity of solid

Cp,solid (J/mol*K) Temperature (K) Reference Comment
238.9298.Silbert, Daubert, et al., 1965βL form.; DH

References

Silbert, Daubert, et al., 1965
Silbert, L.S.; Daubert, B.F.; Mason, L.S., The heats of combustion, formation, and isomerization of isomeric monoglycerides, J. Phys. Chem., 1965, 69, 2887-2894. [all data]