Clotiazepam

Kovats' RI, non-polar column, isothermal

Data compiled by: NIST Mass Spectrometry Data Center, William E. Wallace, director

Column type CapillaryCapillary
Active phase BP-1DB-1
Column length (m) 25.30.
Carrier gas N2N2
Substrate
Column diameter (mm) 0.220.53
Phase thickness (μm) 0.251.5
Temperature (C) 250.250.
I 2513.2530.
ReferenceWeston, Japp, et al., 1991Weston, Japp, et al., 1991
Comment MSDC-RI MSDC-RI

References

Weston, Japp, et al., 1991
Weston, S.I.; Japp, M.; Partridge, J.; Osselton, M.D., Collection of analytical data for benzodiazepines and benzophenones. Appendix, J. Chromatogr., 1991, 538, 2, 277-284, https://doi.org/10.1016/S0021-9673(01)88848-8 . [all data]