Heptafluorobutyric acid, n-hexyl ester

Kovats' RI, non-polar column, isothermal

View large format table.

Column type Active phase Temperature (C) I Reference Comment
CapillaryOV-101100.926.Promyshlennikova, Kirichenko, et al., 1992
CapillaryOV-101100.926.2Promyshlennikova, Kirichenko, et al., 1991He; Column length: 50. m; Column diameter: 0.25 mm
PackedSE-30100.920.Zarazir, Chovin, et al., 1970Chromosorb W; Column length: 2. m
PackedSE-30140.896.Zarazir, Chovin, et al., 1970Chromosorb W; Column length: 2. m

Kovats' RI, polar column, isothermal

View large format table.

Column type Active phase Temperature (C) I Reference Comment
PackedCarbowax 20M100.923.Zarazir, Chovin, et al., 1970Chromosorb W; Column length: 2. m
PackedCarbowax 20M140.907.Zarazir, Chovin, et al., 1970Chromosorb W; Column length: 2. m

Van Den Dool and Kratz RI, non-polar column, temperature ramp

View large format table.

Column type Active phase I Reference Comment
Capillary5 % Phenyl methyl siloxane936.Zaikin, 200930. m/0.25 mm/0.25 μm, 15. K/min, 270. C @ 15. min; Tstart: 60. C

Van Den Dool and Kratz RI, non-polar column, custom temperature program

View large format table.

Column type Active phase I Reference Comment
CapillaryVF-5MS944.Zheng and White, 200830. m/0.25 mm/0.25 μm, He; Program: not specified

Normal alkane RI, non-polar column, temperature ramp

View large format table.

Column type Active phase I Reference Comment
CapillaryOV-101943.Zenkevich and Rodin, 2002Nitrogen, 60. C @ 0. min, 4. K/min, 240. C @ 0. min; Column length: 25. m; Column diameter: 0.25 mm

References

Promyshlennikova, Kirichenko, et al., 1992
Promyshlennikova, E.P.; Kirichenko, V.E.; Pashkevich, K.I.; Grigor'eva, D.N.; Golovnya, R.V., Influence of the stationary phase nature on the retention of polyfluorinated carboxylic acid esters, Zh. Anal. Khim., 1992, 47, 1070-1075. [all data]

Promyshlennikova, Kirichenko, et al., 1991
Promyshlennikova, E.P.; Kirichenko, V.E.; Pashkevich, K.I.; Grigor'eva, D.N.; Golovnya, R.V., Capillary chromatography of polyfluorinated carboxylic esters, Izv. Akad. Nauk SSSR Ser. Khim., 1991, 8, 1541-1545. [all data]

Zarazir, Chovin, et al., 1970
Zarazir, D.; Chovin, P.; Guiochon, G., Identification of hydroxylic compounds and their derivatives by gas chromatography, Chromatographia, 1970, 3, 4, 180-195, https://doi.org/10.1007/BF02269018 . [all data]

Zaikin, 2009
Zaikin, V.G., Personal Communication: Retention indices measured during the period 2008 to 2009, 2009. [all data]

Zheng and White, 2008
Zheng, Y.; White, E., Retention Data. NIST Mass Spectrometry Data Center., NIST Mass Spectrometry Data Center, 2008. [all data]

Zenkevich and Rodin, 2002
Zenkevich, I.G.; Rodin, A.A., Gas Chromatographic One-Step Determination of Number of Hydroxyl Groups in Polyphenols with Mixed Derivatization Reagents, Zh. Anal. Khim. (Rus.), 2002, 57, 7, 732-736. [all data]