5-Amino-2-pyridone

Reaction thermochemistry data

Data compiled by: Hussein Y. Afeefy, Joel F. Liebman, and Stephen E. Stein

Individual Reactions

5-Amino-2-pyridone = 2-Pyridinol, 5-amino-

By formula: C5H6N2O = C5H6N2O

Quantity Value Units Method Reference Comment
Δr7.9kJ/molEqkFujimoto and Inuzuka, 1990liquid phase; solvent: THF

References

Fujimoto and Inuzuka, 1990
Fujimoto, A.; Inuzuka, K., The lactam-lactim tautomerization of monamino-substituted 2-pyridinols in tetrahydrofuran, Bull. Chem. Soc. Jpn., 1990, 63, 2292-2299. [all data]