Silane, trifluoro[4-(dimethylsilyl)phenyl]-

Gas phase ion energetics data

Data compiled by: Sharon G. Lias, Rhoda D. Levin, and Sherif A. Kafafi

Ionization energy determinations

IE (eV) Method Reference
9.2 ± 0.2EIDube and Chvalovsky, 1974

References

Dube and Chvalovsky, 1974
Dube, G.; Chvalovsky, V., Electron impact fragmentation of silyl-substituted phenyldimethylsilanes, Collect. Czech. Chem. Commun., 1974, 39, 2641. [all data]