Benzene,[2-methyl-3-(2-methyl-1-propenylidene)cyclopropyl]-cis-

Gas phase ion energetics data

Data compiled by: Sharon G. Lias, Rhoda D. Levin, and Sherif A. Kafafi

Ionization energy determinations

IE (eV) Method Reference
7.65PEPasto, Fehlner, et al., 1976

References

Pasto, Fehlner, et al., 1976
Pasto, D.J.; Fehlner, T.P.; Schwartz, M.E.; Baney, H.F., On the orbital interactions of three-membered rings with π systems. Electronic structure of alkenylidenecyclopropanes, J. Am. Chem. Soc., 1976, 98, 530. [all data]