1,3,6-Octatriene, 3,7-dimethyl-, (Z)-

Normal alkane RI, non-polar column, custom temperature program

Data compiled by: NIST Mass Spectrometry Data Center, William E. Wallace, director

Column type CapillaryCapillaryCapillaryCapillaryCapillary
Active phase DB-1RTX-1RTX-1Mega-5DB-5 MS
Column length (m) 30.60.60.25.30.
Carrier gas HydrogenHeliumHeliumHeliumHelium
Substrate
Column diameter (mm) 0.250.220.220.250.25
Phase thickness (μm) 0.250.250.250.250.25
Program 45 0C 3 0C/min -> 175 0C 15 0C/min -> 300 0C (10 min)not specifiednot specifiednot specified80 0C (1.5 min) 4 0C/min -> 180 0C 10 0C/min -> 300 0C (10 min)
I 1017.1025.1025.1037.1035.
ReferenceAlbano, Lima, et al., 2012Bendiabdellah, El Amine Dib, et al., 2012Bendiabdellah, El Amine Dib, et al., 2012Dell'Agli, Sanna, et al., 2012Fontes, Ramos, et al., 2012
Comment MSDC-RI MSDC-RI MSDC-RI MSDC-RI MSDC-RI
Column type CapillaryCapillaryCapillaryCapillaryCapillary
Active phase SLB-5 MSSLB-5 MSPolydimethyl siloxane with 5 % Ph groupsPolydimethyl siloxane with 5 % Ph groupsHP-5
Column length (m) 30.30.  25.
Carrier gas HeliumHelium  Hydrogen
Substrate
Column diameter (mm) 0.250.25  0.32
Phase thickness (μm) 0.250.25  0.52
Program not specifiednot specifiednot specifiednot specifiednot specified
I 1035.1038.1040.1049.1037.
ReferenceMondello, 2012Mondello, 2012Robinson, Adams, et al., 2012Robinson, Adams, et al., 2012Velickovic, Ristic, et al., 2012
Comment MSDC-RI MSDC-RI MSDC-RI MSDC-RI MSDC-RI
Column type CapillaryCapillaryCapillaryCapillaryCapillary
Active phase DB-55 % Phenyl polydimethyl siloxaneHP-5 MSCBP-5CP-Sil 8 CB
Column length (m) 30. 30.30.30.
Carrier gas Helium HeliumHeliumHydrogen
Substrate
Column diameter (mm) 0.25 0.250.250.25
Phase thickness (μm) 0.25 0.250.250.25
Program not specifiednot specified60 0C (1 min) 10 0C -> 180 0C (1 min) 20 0C/min -> 280 0C (15 min)60 0C 3 0C/min -> 246 0C 10 0C/min -> 270 0C (5 min)30 0C 3 0C/min -> 150 0C 20 0C/min -> 220 0C
I 1040.1049.1038.1035.1042.
ReferenceCao, Li, et al., 2011Chaverri, Diaz, et al., 2011Chu, Liu, et al., 2011Fortes, Naves, et al., 2011de Freitas, Garruti, et al., 2011
Comment MSDC-RI MSDC-RI MSDC-RI MSDC-RI MSDC-RI
Column type CapillaryCapillaryCapillaryCapillaryCapillary
Active phase HP-5DB-5 MSZB-5ZB-5CP-Sil 8 CB
Column length (m) 30.60.30.30.30.
Carrier gas HeliumHeliumNitrogenNitrogenHelium
Substrate
Column diameter (mm) 0.320.250.250.250.25
Phase thickness (μm) 0.250.250.250.250.25
Program not specified1 0C 1.5 0C/min -> 128 0C 2.57 0C/min -> 170 0C 4 0C/min -> 300 0C (5 min)not specifiednot specifiedMulti-rise program
I 1037.1030.1054.1054.1037.
ReferenceKahriman, Tosun, et al., 2011Usano-Alemany, Penalver, et al., 2011Vazques, Aimar, et al., 2011Vazquez, Demmel, et al., 2011Di Giusto, Bessiere, et al., 2010
Comment MSDC-RI MSDC-RI MSDC-RI MSDC-RI MSDC-RI
Column type CapillaryCapillaryCapillaryCapillaryCapillary
Active phase HP-5HP-5 MSHP-5 MSSLB-5 MSDB-1-MS
Column length (m) 30.30.30.10.60.
Carrier gas HeliumHeliumHeliumHeliumHelium
Substrate
Column diameter (mm) 0.320.250.320.100.25
Phase thickness (μm) 0.250.250.250.100.25
Program not specified60 0C (1 min) 10 0C/min -> 180 0C (1 min) 20 0C/min -> 280 0C (15 min)not specifiednot specifiednot specified
I 1037.1038.1032.1035.1026.
ReferenceKahriman, Tosun, et al., 2010Liu, Chu, et al., 2010Pino, Marquez, et al., 2010Scandinaro, Tranchida, et al., 2010Takeoka, Hobbs, et al., 2010
Comment MSDC-RI MSDC-RI MSDC-RI MSDC-RI MSDC-RI
Column type CapillaryCapillaryCapillaryCapillaryCapillary
Active phase DB-5DB-1 Optima-5MSOptima-5MS
Column length (m) 30.60. 30.30.
Carrier gas HeliumHelium HeliumHelium
Substrate
Column diameter (mm) 0.250.25 0.320.32
Phase thickness (μm) 0.250.25 0.250.25
Program 50 0C m6 0C/min -> 140 0C 5 0C/min -> 160 0C (1 min) 10 0C/min -> 200 0C50 0C (5 min) 3 0C/min -> 120 0C 5 0C/min -> 250 0C (3 min) 15 0C/min -> 300 0C (20 min)not specified40 0C (5 min) 5 0C/min -> 230 0C 30 0C/min -> 280 0C (5 min)40 0C (5 min) 5 0C/min -> 230 0C 30 0C/min -> 280 0C (5 min)
I 1035.1031.1034.1046.1046.
ReferenceCourtois, Paine, et al., 2009Delort and Jaquier, 2009Entezari, Hashemi, et al., 2009HEuskin, Godin, et al., 2009HEuskin, Godin, et al., 2009
Comment MSDC-RI MSDC-RI MSDC-RI MSDC-RI MSDC-RI
Column type CapillaryCapillaryCapillaryCapillaryCapillary
Active phase RTX-5RTX-5DB-1DB-1DB-5
Column length (m) 30.30.30.30.30.
Carrier gas NitrogenNitrogenHydrogenHydrogenHelium
Substrate
Column diameter (mm) 0.250.250.250.250.25
Phase thickness (μm) 0.250.250.250.250.25
Program 60 0C 95 min) 110 0C 3 0C/min -> 200 0C 5 0C/min -> 220 0C 95 min)not specified45 0C 3 0C/min -> 175 0C 15 0C/min -> 300 0C (10 min)45 0C 3 0C/min -> 175 0C 15 0C/min -> 300 0C (10 min)not specified
I 1040.1037.1017.1017.1043.
ReferenceLeela, Vipin, et al., 2009Leela, Vipin, et al., 2009Mendes, Trindade, et al., 2009Mendes, Trindade, et al., 2009, 2Porto, Decorti, et al., 2009
Comment MSDC-RI MSDC-RI MSDC-RI MSDC-RI MSDC-RI
Column type CapillaryCapillaryCapillaryCapillaryCapillary
Active phase DB-5HP-5DB-5 MSCB-1CB-1
Column length (m) 30.30.30.30.30.
Carrier gas Helium HeliumHeliumHelium
Substrate
Column diameter (mm) 0.250.320.250.250.25
Phase thickness (μm) 0.25 0.250.250.25
Program not specifiednot specifiednot specified40 0C (2 min) 4 0C/min -> 180 0C 20 0C/min -> 220 0C (1 min)not specified
I 1043.1042.1037.1037.1029.
ReferencePorto, Decorti, et al., 2009Riahi, Pourbasheer, et al., 2009Su, Wang, et al., 2009Kannaste, Vongvanich, et al., 2008Kannaste, Vongvanich, et al., 2008
Comment MSDC-RI MSDC-RI MSDC-RI MSDC-RI MSDC-RI
Column type CapillaryCapillaryCapillaryCapillaryCapillary
Active phase CP Sil 8 CBSLB-5 MSDB-1CP-Sil 8CB-MSHP-5
Column length (m) 50.30.30.30.30.
Carrier gas HeliumHeliumHeHeliumHelium
Substrate
Column diameter (mm) 0.320.250.250.250.25
Phase thickness (μm) 0.250.250.250.250.25
Program not specifiednot specified45C => 3C/min => 175C => 15C/min => 300C (10min)50 0C(3 min) 3 0C/min -> 100 0C 2.7 0C/min -> 140 0C 2.4 0C/min -> 180 0C 6 0C/min -> 260 0C40 0C (3 min) 3 0C/min -> 160 0C (2 min) 8 0C/min -> 220 0C (3 min)
I 1037.1035.1017.1037.1063.
ReferenceKupcinskiene, Stikliene, et al., 2008Lo Presti, Sciarrone, et al., 2008Nogueira, Marcelo-Curto, et al., 2008Profitt, Schatz, et al., 2008Qiao, Xie, et al., 2008
Comment MSDC-RI MSDC-RI MSDC-RI MSDC-RI MSDC-RI
Column type CapillaryCapillaryCapillaryCapillaryCapillary
Active phase HP-5DB-5 MSRTX-5RTX-55 % Phenyl methyl siloxane
Column length (m) 30.30.30.30.
Carrier gas Helium HeliumHelium
Substrate
Column diameter (mm) 0.250.250.250.25
Phase thickness (μm) 0.250.250.250.25
Program not specified80 0C (1.5 min) 4 pC/min -> 180 0C 10 0C/min -> 300 0C (10 min)60 0C (5 min) 5 0C/min -> 110 0C 3 0C/min -> 220 0C (5 min)not specifiednot specified
I 1036.1045.1041.1037.1049.
ReferenceQiao, Xie, et al., 2008Silva, Doria, et al., 2008Zachariah, Leela, et al., 2008Zachariah, Leela, et al., 2008Agabriel, Cornu, et al., 2007
Comment MSDC-RI MSDC-RI MSDC-RI MSDC-RI MSDC-RI
Column type CapillaryCapillaryCapillaryCapillaryCapillary
Active phase DB-1HP-5MSDB-1HP-5MSDB-5 MS
Column length (m) 30.30.30.30.30.
Carrier gas HeHeHeHeHelium
Substrate
Column diameter (mm) 0.250.250.250.250.25
Phase thickness (μm) 0.10.250.250.250.25
Program 35C => 4C/min => 180C => 10C/min => 250C40C(10min) => 3C/min => 200C => 2C/min => 220C45C => 3C/min => 175C => 15C/min => 300C (10min)40C(5min) => 2C/min => 250C(15min) => 10C/min => 270C60 0C 3 0C/min -> 210 0C 5 0C/min -> 250 0C
I 1035.1038.1017.1038.1040.
ReferenceAlbuquerque, Vasconcelos Silva, et al., 2007Cole, Haber, et al., 2007Ferreira, Meireles de Sousa, et al., 2007Formisano, Mignola, et al., 2007Haznagy-Radnai, Szigle, et al., 2007
Comment MSDC-RI MSDC-RI MSDC-RI MSDC-RI MSDC-RI
Column type CapillaryCapillaryCapillaryCapillaryCapillary
Active phase DB-1CP Sil 8 CBCP Sil 8 CBHP-5 MSHP-5MS
Column length (m) 30.30.50.30.30.
Carrier gas H2HeHeHeliumHe
Substrate
Column diameter (mm) 0.250.250.320.250.25
Phase thickness (μm) 0.250.250.250.250.25
Program 45 0C 3 0C/min -> 175 0C 15 0C/min -> 300 0C (10 min)50C(3min) => 3C/min => 100C => 2.7C/min => 140C => 2.4C/min => 180C => 6C/min => 250C60 0C (2 min) 5 0C/min -> 160 0C 5 0C/min -> 250 0C (10 min)40 0C (10 min) 3 0C/min -> 200 0C 2 0C/min -> 220 0C40C(10min) => 3C/min => 200C => 2C/min => 220C
I 1017.1035.1037.1042.1039.
ReferenceKamatou, Viljoen, et al., 2007Meekijjaroenroj, Bessière, et al., 2007Mockute, Bernotiene, et al., 2007Moriarity, Bansal, et al., 2007Moronkola, Ogunwande, et al., 2007
Comment MSDC-RI MSDC-RI MSDC-RI MSDC-RI MSDC-RI
Column type CapillaryCapillaryCapillaryCapillaryCapillary
Active phase DB-5BPX-5DB-5CP-SilCP-Sil
Column length (m) 50.30.30.30.30.
Carrier gas HeliumHeHydrogenHeliumHelium
Substrate
Column diameter (mm) 0.320.250.250.250.25
Phase thickness (μm) 0.250.250.250.250.25
Program 60 0C (1 min) 5 0C/min -> 160 0C 10 0C/min -> 250 0C50C => 3C/min => 150C(10min) => 10C/min => 250Cnot specified50 0C (3 min) 3 0C/min -> 100 0C 2.7 0C/min -> 140 0C 2.4 0C/min -> 180 0C 6 0C/min -> 250 0C50 0C (3 min) 3 0C/min -> 100 0C 2.7 0C/min -> 140 0C 2.4 0C/min -> 180 0C 6 0C/min -> 250 0C
I 1037.1047.1040.1026.1037.
ReferenceNivinsliene, Butkiene, et al., 2007Ozer H., Sokmen M., et al., 2007Pontes, de Olivera, et al., 2007Proffit, 2007Proffit, 2007
Comment MSDC-RI MSDC-RI MSDC-RI MSDC-RI MSDC-RI
Column type CapillaryCapillaryCapillaryCapillaryCapillary
Active phase CP-SilCP-SilCP Sil 8 CBDB-1HP-5 MS
Column length (m) 30.30.50.30.30.
Carrier gas HeliumHeliumHeliumHeHelium
Substrate
Column diameter (mm) 0.250.250.320.250.25
Phase thickness (μm) 0.250.250.250.25
Program 50 0C (3 min) 3 0C/min -> 100 0C 2.7 0C/min -> 140 0C 2.4 0C/min -> 180 0C 6 0C/min -> 250 0C50 0C (3 min) 3 0C/min -> 100 0C 2.7 0C/min -> 140 0C 2.4 0C/min -> 180 0C 6 0C/min -> 250 0C60 0C (2 min) 5 0C/min -> 160 0C (1 min) 10 0C/min -> 280 0C (3 min)45C => 3C/min => 175C => 15C/min => 300C(10min)40 0C (10 min) 3 oC/min -> 200 0C 2 0C/min -> 220 0C
I 1037.1040.1037.1017.1043.
ReferenceProffit, 2007Proffit, 2007Radusiene, Judzentiene, et al., 2007Rodrigues, Antunes, et al., 2007Setzer, Stokes, et al., 2007
Comment MSDC-RI MSDC-RI MSDC-RI MSDC-RI MSDC-RI
Column type CapillaryCapillaryCapillaryCapillaryCapillary
Active phase DB-5HP-5 MSOV-1HP-5MSSPB-5
Column length (m) 30. 30.30.60.
Carrier gas Helium HeliumHeHe
Substrate
Column diameter (mm) 0.25 0.250.250.32
Phase thickness (μm) 0.50 0.25 1.
Program 35 0C (6 min) 5 0C/min -> 50 0C 2 0C/min -> 70 0C 3 0C/min -> 150 0C 5 0C/min -> 200 0Cnot specified40 0C (2 min) 6 0C/min -> 130 0C 10 0C/min -> 300 0C40C(10min) => 3C/min => 200C => 2C/min => 220C60C => 1C/min => 130C => 2C/min => 200C => 4C/min => 250C (40min)
I 1036.1038.1026.1043.1031.
ReferenceSoares, Pereira, et al., 2007Stokes, Cole, et al., 2007Suschke, Sporer, et al., 2007Takaku, Haber, et al., 2007Chemat, Lucchesi, et al., 2006
Comment MSDC-RI MSDC-RI MSDC-RI MSDC-RI MSDC-RI
Column type CapillaryCapillaryCapillaryCapillaryCapillary
Active phase HP-5MSSPB-5CP Sil 8 CBCP Sil 8 CBSPB-5
Column length (m) 30.60.50.50.30.
Carrier gas HeHeHeHeHelium
Substrate
Column diameter (mm) 0.250.320.320.320.25
Phase thickness (μm) 0.251.0.250.250.10
Program 50C(2min) => 6C/min => 200C => 10C/min => 270C(10min)60C => 1C/min => 130C => 2C/min => 200C => 4C/min => 250C(40min)60C(2min) => 5C/min => 160C(1min) => 10C/min => 250C (5min)60 0C (2 min) 5 0C/min -> 160 0C 10 0C/min -> 250 0C (5 min)40 0C (1 min) 10 0C/min -> 120 0C 0.5 0C/min -> 150 0C 20 0C/min -> 280 0C (5 min)
I 1041.1031.1037.1037.1040.
ReferenceDeng, Xu, et al., 2006Iriti, Colnaghi, et al., 2006Judzentiene and Buzelyte, 2006Mockute, Bernotiene, et al., 2006Navickiene, Morandim, et al., 2006
Comment MSDC-RI MSDC-RI MSDC-RI MSDC-RI MSDC-RI
Column type CapillaryCapillaryCapillaryCapillaryCapillary
Active phase HP-5MSDB-1DB-5SE-52VF-5MS
Column length (m) 30. 30.30.30.
Carrier gas HeHeliumHeHeHe
Substrate
Column diameter (mm) 0.32 0.320.320.25
Phase thickness (μm) 0.25 0.250.150.25
Program 60C(1min) => 1.5C => 185C => 9C/min => 275C (2min)not specified60C => 2C/min => 100C => 3C/min => 160C => 5C/min => 280C45C => 1C/min => 100C => 5C/min => 250C (10min)40C(1min) => 15C/min => 100C => 4C/min => 250C (1min)
I 1040.1035.1040.1037.1034.
ReferenceSingh G., Maurya S., et al., 2006Soumaghi, Amin, et al., 2006Srivastava, Mallavarapu, et al., 2006Tognolini, Barocelli, et al., 2006Xie, Sun, et al., 2006
Comment MSDC-RI MSDC-RI MSDC-RI MSDC-RI MSDC-RI
Column type CapillaryCapillaryCapillaryCapillaryCapillary
Active phase DB-1DB-5DB-1DB-1HP-5
Column length (m) 30.30.30.30.50.
Carrier gas HeHeHeHeHe
Substrate
Column diameter (mm) 0.250.250.250.250.2
Phase thickness (μm) 0.250.250.250.250.5
Program 45C => 3C/min => 175C => 15C/min => 300C(10min)35C => 4C/min => 180C => 10C/min => 250C45C => 3C/min => 175C => 15C/min => 300C (10min)45C => 3C/min => 175C => 15C/min => 300C (10min)40C(1min) => 5C/min => 210C => 20C/min => 250C(8min)
I 1017.1027.1017.1017.1025.
ReferenceBelhattab, Larous, et al., 2005Cysne, Canuto, et al., 2005Faleio, Miguel, et al., 2005Figueiredo, Sim-Sim, et al., 2005Himanen, Vuorinen, et al., 2005
Comment MSDC-RI MSDC-RI MSDC-RI MSDC-RI MSDC-RI
Column type CapillaryCapillaryCapillaryCapillaryCapillary
Active phase BPX-5BPX-5CP Sil 8 CBHP-5DB-5
Column length (m) 30.30.50.30.30.
Carrier gas HeHeHe He
Substrate
Column diameter (mm) 0.250.320.320.320.25
Phase thickness (μm) 0.250.50.25 0.1
Program 50C => 3C/min => 150C (10min) => 10C/min => 250C60C(1min) => 3.5C/min => 180C => 20C/min => 280C(2min)60C(2min) => 5C/min => 160C(1min) => 10C/min => 250C (3min)65C(1min) => 1C/min => 75C (2min) => 0.5C/min => 81C(2min) => 3C/min => 180C(7min)35C => 4C/min => 180C => 10C/min => 250C
I 1040.1040.1040.1040.1026.
ReferenceKordali, Kotan, et al., 2005Koutsoudaki, Krsek, et al., 2005Radudienë, Judpintienë, et al., 2005Singh, Maurya, et al., 2005Albuquerque, Souza, et al., 2004
Comment MSDC-RI MSDC-RI MSDC-RI MSDC-RI MSDC-RI
Column type CapillaryCapillaryCapillaryCapillaryCapillary
Active phase DB-1CP Sil 8 CBDB-1CP Sil 8 CBCP Sil 8 CB
Column length (m) 30.50.30.50.50.
Carrier gas HeHeHeHeHe
Substrate
Column diameter (mm) 0.250.320.250.320.32
Phase thickness (μm)  0.250.25 0.25
Program 35C => 4C/min => 180C => 10C/min => 250C60C(2min) => 5C/min => 160C(1min) => 10C/min => 250C (5min)45C => 3C/min => 175C => 15C/min => 300C (10min)50 0C (2 min) 3 0C/min -> 180 0C (1 min) 20 0C/min -> 250 0C (2 min)50C(2min) => 3C/min => 180C(1min) => 20C/min => 250C (2min)
I 1039.1040.1017.1040.1040.
ReferenceCavalcanti, de Morais, et al., 2004Judpentienë and Mockutë, 2004Miguel, Simões, et al., 2004Mockutë, Bernotienë, et al., 2004Mockutë, Judbentienë, et al., 2004
Comment MSDC-RI MSDC-RI MSDC-RI MSDC-RI MSDC-RI
Column type CapillaryCapillaryCapillaryCapillaryCapillary
Active phase HP-5MSDB-1HP-5DB-5SE-30
Column length (m) 30.30.30.
Carrier gas HeHeliumHe
Substrate
Column diameter (mm) 0.250.250.25
Phase thickness (μm) 0.250.250.25
Program 50C(3min) => 3C/min => 150C(10min) => 10C/min => 250C35 0C 4 0C/min -> 180 0C 10 0C/min -> 250 0C50C (3min) => 3C/min => 150C (10min) => 10C/min => 250Cnot specifiednot specified
I 1037.1021.1037.1040.1024.
ReferenceSahin, Gulluce, et al., 2004Silva, Matos, et al., 2004Tepe, Donmez, et al., 2004Vilaseca, Guy, et al., 2004Vinogradov, 2004
Comment MSDC-RI MSDC-RI MSDC-RI MSDC-RI MSDC-RI
Column type CapillaryCapillaryCapillaryCapillaryCapillary
Active phase SE-30HP-5CP-Sil 8CB-MSHP-5DB-5
Column length (m)  30.50.30.30.
Carrier gas   HeHeHe
Substrate
Column diameter (mm)  0.250.320.250.25
Phase thickness (μm)  0.25 0.250.25
Program not specified40C(6min) => 2.5C/min => 150C => 90C/min => 250C50C(2min) => 3C/min => 180C(1min) => 20C/min => 250C(2min)60C(5min) => 1C/min => 140C => 10C/min => 270C(5min)60C => 3C/min => 210C => 5C/min => 250C(2min)
I 1025.1037.1040.1040.1037.5
ReferenceVinogradov, 2004Jordán, Margaría, et al., 2003Mockute, Bernotiene, et al., 2003Singh, Singh, et al., 2003Veres, Varga, et al., 2003
Comment MSDC-RI MSDC-RI MSDC-RI MSDC-RI MSDC-RI
Column type CapillaryCapillaryCapillaryCapillaryCapillary
Active phase SE-54HP-1DB-5DB-5HP-5
Column length (m)  30.30.30.30.
Carrier gas  HeHeHe
Substrate
Column diameter (mm)  0.320.250.250.25
Phase thickness (μm)  0.250.10.250.25
Program not specified40C(3min) => 5C/min => 180C => 15C/min => 240C(15min)35C => 4C/min => 180C => 10C/min => 250C35C => 4C/min => 180C => 20C/min => 280Cnot specified
I 1038.1059.1042.1030.1031.
ReferenceKilic, 2002Nogueira and Romano, 2002Pessoa, Morais, et al., 2002Viana, Andrade-Neto, et al., 2002Aparicio, Romero, et al., 2001
Comment MSDC-RI MSDC-RI MSDC-RI MSDC-RI MSDC-RI
Column type CapillaryCapillaryCapillaryCapillaryCapillary
Active phase CP Sil 8 CBDB-5DB-1HP-5 MSHP-5
Column length (m) 60. 30.30.30.
Carrier gas    HeliumHe
Substrate
Column diameter (mm) 0.25 0.250.250.25
Phase thickness (μm) 0.25 0.250.250.25
Program not specifiednot specified45 0C 3 K/min -> 175 0C 15 K/min -> 300 0C (10 min)not specified50 0C 3 K/min -> 200 0C 8 K/min -> 280 0C
I 1040.1034.1017.1027.1030.
ReferenceDuckham, Dodson, et al., 2001Ferreira, Costantin, et al., 2001Figueiredo, Miguel, et al., 2001Shang, Hu, et al., 2001Usubillaga, Aparicio, et al., 2001
Comment MSDC-RI MSDC-RI MSDC-RI MSDC-RI MSDC-RI
Column type CapillaryCapillaryCapillaryCapillaryCapillary
Active phase DB-5CBP-1DB-1DB-1SE-30
Column length (m) 30. 30.30.30.
Carrier gas He H2HeHelium
Substrate
Column diameter (mm) 0.25 0.250.250.25
Phase thickness (μm) 0.25 0.250.250.20
Program 40C => 2C/min => 60C => 4C/min => 260Cnot specified40 0C 3 K/min -> 175 0C 15 K/min -> 240 0C (10 min)45C => 3C/min => 170C => 15C/min => 300C(10min)not specified
I 1033.1037.1017.1017.1025.
ReferenceAndrade, Maia, et al., 2000Juliani, Biurrun, et al., 2000da Silva, Pedro, et al., 2000Pedro, da Silva, et al., 1999Prikhod'ko, Klyuev, et al., 1999
Comment MSDC-RI MSDC-RI MSDC-RI MSDC-RI MSDC-RI
Column type CapillaryCapillaryCapillaryCapillaryCapillary
Active phase DB-1DB-1DB-1OV-1DB-5
Column length (m) 30.60.30.50.30.
Carrier gas HeN2HeHeN2
Substrate
Column diameter (mm) 0.250.320.250.320.25
Phase thickness (μm) 0.250.250.250.250.25
Program 45C => 3C/min => 175C => 15C/min => 300C(10min)40 0C (10 min) 40 - 80 0C at 2 0C/min 80 - 200 0C at 5 0C/min 200 0C (10 min)45C => 3C/min => 175C => 15C/min => 240C (10min)1)50C(1min) => 4C/min => 180C => 2C/min => 250C(10min) 2)50C(1min) => 6C/min => 200C => 12C/min => 250C(5min)45C(5min) => 2C/min => 200C => 5C/min => 250C
I 1017.1028.1017.1021.1046.
ReferenceSantos, Figueiredo, et al., 1999Yen and Lin, 1999Baratta, Dorman, et al., 1998Kökdil, 1998Sanda, Koba, et al., 1998
Comment MSDC-RI MSDC-RI MSDC-RI MSDC-RI MSDC-RI
Column type CapillaryCapillaryCapillaryCapillaryCapillary
Active phase DB-5DB-1DB-5SPB-SulfurDB-1
Column length (m) 30.30. 30.30.
Carrier gas HeH2 HeH2
Substrate
Column diameter (mm) 0.250.25 0.320.25
Phase thickness (μm) 0.250.25 4.0.25
Program 60C => 3C/min => 240C => 30C/min => 300C45C => 3C/min => 175C => 15C/min => 240C(10min)not specifiednot specified45 0C 3 0C/min -> 175 0C 15 0C/min -> 240 0C (10 min)
I 1033.1017.1040.1025.1017.
ReferenceYusuf, Begum, et al., 1998Figueiredo, Barroso, et al., 1997Isidorov, Zenkevich, et al., 1997Mariaca, Berger, et al., 1997Barroso, Figueiredo, et al., 1996
Comment MSDC-RI MSDC-RI MSDC-RI MSDC-RI MSDC-RI
Column type CapillaryCapillaryCapillaryCapillaryCapillary
Active phase DB-1Methyl SiliconeDB-1DB-1DB-1
Column length (m) 30. 60.60.60.
Carrier gas Helium  HeHe
Substrate
Column diameter (mm) 0.25 0.320.320.32
Phase thickness (μm)    0.250.25
Program 35 0C 4 0C/min -> 180 0C 10 0C/min -> 250 0Cnot specifiednot specified-80 C (20 min; during thermal desorption) 50-200 C at 4 C/min 200-320 C at 10 C/min-80 C (20 min; during thermal desorption) 50-200 C at 4 C/min 200-320 C at 10 C/min
I 1015.1027.1026.1025.1026.
Referencede Morais, Craveiro, et al., 1996Zenkevich, 1996Binder and Flath, 1989Miller, Bills, et al., 1989Miller, Bills, et al., 1989
Comment MSDC-RI MSDC-RI MSDC-RI MSDC-RI MSDC-RI
Column type CapillaryCapillaryCapillaryCapillaryPacked
Active phase DB-1DB-1OV-1OV-101OV-101
Column length (m) 30.30.35. 2.5
Carrier gas H2H2  N2
Substrate     Chromosorb G 60-80mesh DMCS
Column diameter (mm) 0.250.250.50
Phase thickness (μm) 0.250.251.5
Program 30C (2min) => 2C/min => 150C => 4C/min => 250C30C (2min) => 2C/min => 150C => 4C/min => 250Cnot specifiednot specifiednot specified
I 1025.1026.1027.1025.1027.
ReferenceTakeoka, Flath, et al., 1988Takeoka, Flath, et al., 1988De Pooter and Schamp, 1987Shibamoto, 1987Swigar and Silverstein, 1981
Comment MSDC-RI MSDC-RI MSDC-RI MSDC-RI MSDC-RI

Kovats' RI, polar column, custom temperature program

Data compiled by: NIST Mass Spectrometry Data Center, William E. Wallace, director

Column type Capillary
Active phase Carbowax
Column length (m) 127.
Carrier gas
Substrate
Column diameter (mm) 0.75
Phase thickness (μm)
Program not specified
I 1240.
ReferenceOkamoto, Ellison, et al., 1981
Comment MSDC-RI

Van Den Dool and Kratz RI, non-polar column, custom temperature program

Data compiled by: NIST Mass Spectrometry Data Center, William E. Wallace, director

Column type CapillaryCapillaryCapillaryCapillaryCapillary
Active phase DB-5BPX-5SE-52SE-52SE-52
Column length (m) 30.30.30.30.30.
Carrier gas He HeHeHe
Substrate
Column diameter (mm) 0.250.250.320.320.32
Phase thickness (μm) 0.250.250.150.150.15
Program 40C(2min) => 4C/min => 220C => 20C/min => 280C35C(5min) => 3C/min => 210C => 40C/min => 240C (4min)45C => 1C/min => 100C => 5C/min => 250C (10min)45C => 1C/min => 100C => 5C/min => 250C(10min)45C => 1C/min => 100C => 5C/min => 250C(10min)
I 1037.1035.1037.1037.1037.
ReferenceAndrade, Sampaio, et al., 2007Cardeal, da Silva, et al., 2006Guerrini, Sacchetti, et al., 2006Sacchetti, Guerrini, et al., 2006Bruni, Pellati, et al., 2005
Comment MSDC-RI MSDC-RI MSDC-RI MSDC-RI MSDC-RI
Column type CapillaryCapillaryCapillaryCapillaryCapillary
Active phase SE-525 % Phenyl methyl siloxaneDB-5MSSE-52SE-52
Column length (m) 25.30.30.25.30.
Carrier gas H2HeHe He
Substrate
Column diameter (mm) 0.320.320.250.320.52
Phase thickness (μm) 0.430.150.250.40.15
Program 60C(8min) => 3C/min => 180C => 20C/min => 250C(10min)45C => 1C/min => 100C => 5C/min => 250C (10min)40 (5min) => 4C/min => 140C => 4C/min => 200C (20min)60C(8min) => 3C/min => 180C => 20C/min => 250C(10min)45C => 1C/min => 100C => 5C/min => 250C (10min)
I 1035.1037.1036.1038.1037.
ReferenceLorenzo, Paz, et al., 2005Sacchetti, Maietti, et al., 2005Zheng, Kim, et al., 2005Lorenzo, Paz, et al., 2004Sacchetti, Medici, et al., 2004
Comment MSDC-RI MSDC-RI MSDC-RI MSDC-RI MSDC-RI
Column type CapillaryCapillaryCapillaryCapillaryCapillary
Active phase SE-52DB-5SE-52SE-52BP-1
Column length (m) 25.30.25.30.50.
Carrier gas HeHeH2H2
Substrate
Column diameter (mm) 0.250.250.320.320.22
Phase thickness (μm) 0.250.250.400.420.25
Program 60C(8min) => 3C/min => 180C => 20C/min => 230C60C(2min) => 3C/min => 240C => 10C/min => 270C (4.5min)60 C (8 min) 3 C/min -> 180 C 20 C/min -> 250 C (10 min)60C(8min) => 3C/min => 180C => 20C/min => 250C(10min)not specified
I 1035.1043.1038.1040.1025.
ReferenceLorenzo, Loayza, et al., 2003Passos X.S., Castro A.C.M., et al., 2003Lorenzo, Loayza, et al., 2002Lorenzo, Paz, et al., 2002Cavalli, Ranarivelo, et al., 2001
Comment MSDC-RI MSDC-RI MSDC-RI MSDC-RI MSDC-RI
Column type CapillaryCapillaryCapillaryCapillaryCapillary
Active phase CP Sil 8 CBSE-52SE-52DB-5MSBP-1
Column length (m) 60.30.25.30.
Carrier gas  H2HeHe
Substrate
Column diameter (mm) 0.250.320.250.25
Phase thickness (μm) 0.250.400.250.25
Program 0C => rapidly => 40C(8min) => 4C/min => 250C(10min)60 0C (8 min) 3 K/min -> 180 0C 20 K/min -> 250 0C (10 min)60 0C (8 min) 3 K/min -> 180 0C 20 K/min -> 230 0C60 0C (3 min) 2 K/min -> 220 0C 5 K/min -> 250 0C (15 min)not specified
I 1038.1037.1034.1035.1025.
ReferenceDuckham, Dodson, et al., 2001Lorenzo, Paz, et al., 2001Lorenzo, Saavedra, et al., 2001Boulanger and Crouzet, 2000Filippini, Tomi, et al., 2000
Comment MSDC-RI MSDC-RI MSDC-RI MSDC-RI MSDC-RI
Column type CapillaryCapillaryCapillary
Active phase DB-5DB-5SE-52
Column length (m) 30.30.25.
Carrier gas H2H2He
Substrate
Column diameter (mm) 0.250.250.25
Phase thickness (μm) 0.250.250.25
Program 40C(5min) => 2C/min => 220C => 5C/min => 250C(15min)40C(5min) => 2C/min => 220C => 5C/min => 250C(15min)60 0C (8 min) 3 K/min -> 180 0C 20 K/min -> 230 0C
I 1037.1040.1049.
ReferenceBoulanger, Chassagne, et al., 1999Boulanger, Chassagne, et al., 1999Loayza, de Groot, et al., 1999
Comment MSDC-RI MSDC-RI MSDC-RI

References

Albano, Lima, et al., 2012
Albano, S.M.; Lima, A.S.; Miguel, M.G.; Pedro, L.G.; Barroso, J.G.; Figueiredo, A.C., Antioxidant, anti-5-lipoxygenase and antiacetylcholinesterase activities of essential oils and decoction water of some aromatic plants, Rec. Nat. Prod., 2012, 6, 1, 35-48. [all data]

Bendiabdellah, El Amine Dib, et al., 2012
Bendiabdellah, A.; El Amine Dib, M.; Djabou, N.; Allali, H.; Tabti, B.; Costa, J.; Myseli, A., Biological activities and volatile cinstituents of Daucus muricatus L. from Algeria, Chem. Centr. J., 2012, 6, 48, 1-22. [all data]

Dell'Agli, Sanna, et al., 2012
Dell'Agli, M.; Sanna, C.; Rubiolo, P.; BAsilico, N.; Colombo, E.; Scaltrito, M.M.; Ndiath, M.O.; Maccarone, L.; Taramelli, D.; Bicchi, C.; Ballero, M.; Bosisio, E., Anti-plasmodial and insecticidal activities of the essential oils of aromatic plants growing in the Mediterranian area, Malaria Journal, 2012, 11, 1, 219-228, https://doi.org/10.1186/1475-2875-11-219 . [all data]

Fontes, Ramos, et al., 2012
Fontes, U.R.; Ramos, C.S.; Serafini, M.R.; Canalcanti, S.C.H.; Alves, P.B.; Lima, G.M.; Andrade, P.H.S.; Bonjardim, L.R.; Quintans, L.J.; Araujo, A.A.S., Evaluation of the lethality of Porophyllum ruderale essential oil against Biomphalaria glabrata, Aedes aegtpti and Artemia salina, Afr. J. Biotechnol., 2012, 11, 13, 3169-3172. [all data]

Mondello, 2012
Mondello, L., HS-SPME-GCxGC-MS analysis of Yerba Mate (Ilex paraguariensis) in Shimadzu GC-GC application compendium of comprehensive 2D GC, Vol. 1-5, Shimadzu Corp., 2012, 1-29. [all data]

Robinson, Adams, et al., 2012
Robinson, A.L.; Adams, D.O.; Boss, P.K.; Heymann, H.; Solomon, P.S.; Trengove, R.D., Influence of geographic origine on the sensory characteristics and wine composition of Vitus viniferas cv. Cabernet Sauvignon wines from Australia (Supplemental data), Am. J. Enol. Vitic., 2012, 64, 4, 467-476, https://doi.org/10.5344/ajev.2012.12023 . [all data]

Velickovic, Ristic, et al., 2012
Velickovic, D.T.; Ristic, M.S.; Karabegovic, I.T.; Stojicevic, S.S.; Lazic, M.L., The influence of the distillation method on the chemical composition of the essential oil of sage (Salvia officinalis L.), Advanced Technologies, 2012, 1, 1, 47-51. [all data]

Cao, Li, et al., 2011
Cao, H.; Li, Z.; Chen, X., QSRR study of GC retention indices of volatile compounds emitted from Mosla chinensis Maxim. by multiply linear regression, Chin. J. Chem., 2011, 29, 10, 2187-2196, https://doi.org/10.1002/cjoc.201180379 . [all data]

Chaverri, Diaz, et al., 2011
Chaverri, C.; Diaz, C.; Cicco, J.F., Chemical analysis of essential oils from Ocotea gomezii W.C. Burger and Ocotea morae Gomez-Laur. (Lauraceae) collected at Reserva biologica Alberto M. Brenes in Costa Rica and their cytotoxic activity on Tumor cell lines, J. Braz. Chem. Soc., 2011, 22, 4, s1-s4, https://doi.org/10.1590/S0103-50532011000400018 . [all data]

Chu, Liu, et al., 2011
Chu, S.S.; Liu, S.L.; Liu, Q.Z.; Liu, Z.L.; Du, S.S., Composition and toxicity of Chinese Dracocephalum moldavica (Labiatae) essential oil against two grain storage insects, J. Med. Plants Res., 2011, 5, 21, 5262-5267. [all data]

Fortes, Naves, et al., 2011
Fortes, G.A.C.; Naves, S.S.; Godoi, F.F.F.; Duarte, A.R.; Ferri, P.H.; Santos, S.C., Assessment of a maturity index in Jabuticaba fruit by the evaluation of phenolic compounds, essential oil components, sugar content and total acidity, Amer. J. Food Technol., 2011, 6, 11, 974-984, https://doi.org/10.3923/ajft.2011.974.984 . [all data]

de Freitas, Garruti, et al., 2011
de Freitas, V.M.; Garruti, D. dosS.; Souza Neto, M.A.; Facundo, H.V. daV.; Correia, J.M., Stability of volatile profile and sensory properties of passion fruit during storage in glass bottles, Ciencia e Tecnologia de Alimentos, Campinas, 2011, 31, 2, 349-354, https://doi.org/10.1590/S0101-20612011000200011 . [all data]

Kahriman, Tosun, et al., 2011
Kahriman, N.; Tosun, G.; Terzioglu, S.; Karaoglu, S.A.; Yayh, N., Chemical composition and antimicrobial activity of the essential oils from the flower, leaf, and stem of Senecio pandurifolis, Rec. Nat. Prod., 2011, 5, 2, 82-91. [all data]

Usano-Alemany, Penalver, et al., 2011
Usano-Alemany, J.; Penalver, D.H.; Ortiz, J.C.; Lopez, B. deB.; Ruiz, O.S.; Pala-Paul, J., Ecological production of lavenders in Cuenca province (Spain). A study of yield production and quality of the essential oil, Botanica Computensis, 2011, 35, 147-152. [all data]

Vazques, Aimar, et al., 2011
Vazques, A.M.; Aimar, M.L.; Demmel, G.I.; Criado, S.G.; Ruiz, G.M.; Cantero, J.J.; Rossi, L.I.; Velasco, M.I., Determination of volatile organic compounds of Tagetes argentina Cabrera (asteraceae) using HS-SPME analysis, Boletin Latinoamericano y del Caribe Plantas Medicinales y Aromaticas, 2011, 10, 5, 463-469. [all data]

Vazquez, Demmel, et al., 2011
Vazquez, A.M.; Demmel, G.I.; Criado, S.G.; Aimar, M.L.; Cantero, J.; Rossi, L.I.; Velasco, M.I., Phytochemistry of TAgetes minuta L. (Asteraceae) from Cordoba, Argentina: comparative study between essential oil and HS-SPME analyses, Boletin Latinoamericano y del Caribe Plantas Medicinales y Aromaticas, 2011, 10, 4, 351-362. [all data]

Di Giusto, Bessiere, et al., 2010
Di Giusto, B.; Bessiere, J.-M.; Gueroult, M.; Lim, L.B.L.; Marshall, D.J.; Hossaert-McKey, M.; Gaume, L., Flower-scent mimicry masks a deadly trap in the carnivorous plant Nepenthes raffesiana, J. Ecology, 2010, 98, 4, 845-856, https://doi.org/10.1111/j.1365-2745.2010.01665.x . [all data]

Kahriman, Tosun, et al., 2010
Kahriman, N.; Tosun, G.; Genc, H.; Yayli, N., Comparative essential oil analysis of Geranium sylvaticum estracted by hydrodistillation and microwave distillation, Turk. J. Chem., 2010, 34, 969-976. [all data]

Liu, Chu, et al., 2010
Liu, Z.L.; Chu, S.S.; Liu, Q.R., Chemical composition and insecticidial activity against Sitophilus zeamais of the essential oils of Artemisia capillaris and Artemisia mongolica, Molecules, 2010, 15, 4, 2600-2608, https://doi.org/10.3390/molecules15042600 . [all data]

Pino, Marquez, et al., 2010
Pino, J.A.; Marquez, E.; Quijano, C.E.; Castro, D., Volatile compounds in noni (Morinda citrifolia L.) at two ripening stages, Ciencia e Technologia de Alimentos, 2010, 30, 1, 183-187, https://doi.org/10.1590/S0101-20612010000100028 . [all data]

Scandinaro, Tranchida, et al., 2010
Scandinaro, M.; Tranchida, P.Q.; Costa, R.; Dugo, P.; Mondello, L., Rapid Quality Control of Flavours and Fragrances using Fast GC-MS and Multi-MS Library Search Procedures, LCGC Europe, 2010, 23, 9, 456-464. [all data]

Takeoka, Hobbs, et al., 2010
Takeoka, G.R.; Hobbs, C.; Byeoung-Soo, P., Volatile constituents of the aerial parts of Salvia apiana Jepson, J. Essential Oil. Res., 2010, 22, 3, 241-244, https://doi.org/10.1080/10412905.2010.9700314 . [all data]

Courtois, Paine, et al., 2009
Courtois, E.A.; Paine, C.E.; Blandinieres, P.-A.; Stien, D.; Bessiere, J.-M.; Houel, E.; Baraloto, C.; Chave, J., Diversity of the volatile organic compounds emitted by 55 species of tropical trees: a survey in French Guiana, J. Chem. Ecol., 2009, 35, 11, 1349-1362, https://doi.org/10.1007/s10886-009-9718-1 . [all data]

Delort and Jaquier, 2009
Delort, E.; Jaquier, A., Novel terpenyl esters from Australian finger lime (Citrus australasica) peel extract, Flav. Fragr. J., 2009, 24, 3, 123-132, https://doi.org/10.1002/ffj.1922 . [all data]

Entezari, Hashemi, et al., 2009
Entezari, M.; Hashemi, M.; Ashki, M.; Ebrahimian, S.; Bayat, M.; Saraji, A.R.A.; Rohani, S.R., Studying the effect Echinophora platyloba extract on Bactira (Staphillococus aureau and Pseudomonas aeroginosa) and Fungi (Candidia albicans, Aspergilus flavus and Aspergilus niger) in vitro, World J. Med. Sci., 2009, 4, 2, 89-92. [all data]

HEuskin, Godin, et al., 2009
HEuskin, S.; Godin, B.; Leroy, P.; Quentin C.; Wathelet, J.-P.; Verheggen, F.; Haubruge, E.; Lognay, G., Fast gas chromatography characterization of purified semiochemicals from essential oils of Matricaria chamomilla L. (Asteraceae) and Nepeta cataria L. (Lamiaceae), J. Chromatorg. A., 2009, 1216, 14, 2768-2775, https://doi.org/10.1016/j.chroma.2008.09.109 . [all data]

Leela, Vipin, et al., 2009
Leela, N.K.; Vipin, T.M.; Shafeekh, K.M.; Priyanka, V.; Rema, J., Chemical composition of essential oils from aerial parts of Cinnamomum malabatrum (Burman f.) Bercht Presl., Flavor Fragr. J., 2009, 24, 1, 13-16, https://doi.org/10.1002/ffj.1910 . [all data]

Mendes, Trindade, et al., 2009
Mendes, M.D.; Trindade, H.; Figueiredo, A.C.; Pedro, L.G.; Barroso, J.G., Chaerophyllum azoricun Trel. grown in the Azores archipelago, Portugal: evaluation of the genetic diversity using molecular markers and comparison with volatile oils profiles, Flavour Fragr. J., 2009, 24, 5, 259-265, https://doi.org/10.1002/ffj.1939 . [all data]

Mendes, Trindade, et al., 2009, 2
Mendes, M.D.; Trindade, H.; Figueiredo, A.C.; Barroso, J.G.; Fontinha, S.S.; Pedro, L.G., Volatile and molecular characterization of two Portuguese endemic species: Angelica lignescens and Melanoselinium decipiens, Biochen. Systematics Ecol., 2009, 37, 2, 98-105, https://doi.org/10.1016/j.bse.2008.12.006 . [all data]

Porto, Decorti, et al., 2009
Porto, C.Da.; Decorti, D.; Kikic, I., Flavour compounds of Lavandula angustifolia L. to use in food manufacturing: comparison of three different extraction methods, Food Chem., 2009, 112, 4, 1072-1078, https://doi.org/10.1016/j.foodchem.2008.07.015 . [all data]

Riahi, Pourbasheer, et al., 2009
Riahi, S.; Pourbasheer, E.; Ganjali, M.R.; Norouzi, P., Investigation of different linear and non-linear chemometric methods for modeling of retention index of essential oil components: Concerns to support vector mashine, J. Hazard. Mat., 2009, 166, 2-3, 853-859, https://doi.org/10.1016/j.jhazmat.2008.11.097 . [all data]

Su, Wang, et al., 2009
Su, Y.; Wang, C.; Yinlong, G., Analysis of volatile compounds from Mentha hapioealyx Briq. by GC-MS based on accurate mass measurements and retention indices, Acta Chem. Sinica, 2009, 67, 6, 546-554. [all data]

Kannaste, Vongvanich, et al., 2008
Kannaste, A.; Vongvanich, N.; Borg-Karlson, A.-K., Infestation by a Nalepella species induces emissions of alpha- and beta-farnesenes, (-)-linalool and aromatic compounds in Norway spruce clones of different susceptibility to the large pine weevil, Anthropod-Plant Interactions, 2008, 2, 1, 31-41, https://doi.org/10.1007/s11829-008-9029-4 . [all data]

Kupcinskiene, Stikliene, et al., 2008
Kupcinskiene, E.; Stikliene, A.; Judzentiene, A., The essential oil guatitative composition in the needles of Pinus sylvestris L. growing along industrial transects, Environ. Pollution, 2008, 155, 3, 481-491, https://doi.org/10.1016/j.envpol.2008.02.001 . [all data]

Lo Presti, Sciarrone, et al., 2008
Lo Presti, M.; Sciarrone, D.; Crupi, M.C.; Costa, R.; Ragusa, S.; Dugo, G.; Mondello, L., Evaliation of the volatile and chiral composition in Pistacia lentiscus L. essential oil, Flavour Fragr. J., 2008, 23, 4, 249-257, https://doi.org/10.1002/ffj.1878 . [all data]

Nogueira, Marcelo-Curto, et al., 2008
Nogueira, T.; Marcelo-Curto, M.J.; Cristina Figueiredo, A.; Barroso, J.G.; Pedro, L.G.; Rubiolo, P.; Bicchi, C., Chemotaxonomy of Hypericum genus from Portugal: Geographical distribution and essential oils composition of Hypericum perfoliatum, Hypericum humifusum, Hypericum linarifolium and Hypericum pulchrum, Biochem. Syst. Ecol., 2008, 36, 1, 40-50, https://doi.org/10.1016/j.bse.2007.07.004 . [all data]

Profitt, Schatz, et al., 2008
Profitt, M.; Schatz, B.; Bessiere, J.-M.; Chen, C.; Soler, C.; Hossaert-McKey, M., Signalling receptivity: comparison of the emission of volatile compounds by figs of Ficus hispida before, during and after the phase of receptivity to pollinators, Symbiosis, 2008, 45, 1-10. [all data]

Qiao, Xie, et al., 2008
Qiao, Y.; Xie, B.J.; Zhang, Y.; Zhang, Y.; FAn, G.; Yao, X.L.; Pan, S.Y., Characterization of aroma active compounds in fruit juice and peel oil of Junchen sweet orange fruit (Citrus sinensis (L.) Osbeck) by GC-MS and GC-O, Molecules, 2008, 13, 6, 1333-1344, https://doi.org/10.3390/molecules13061333 . [all data]

Silva, Doria, et al., 2008
Silva, W.L.; Doria, G.A.A.; Maia, R.T.; Nunes, R.S.; Carvalho, G.A.; Blank, A.F.; Alves, P.B.; Marcal, R.M.; Cavalcanti, S.C.H., Effects of essential oils on Aedes aegypti larvae: alternatives to environmentally safe insecticides, Bioresource Technol., 2008, 99, 8, 3251-3255, https://doi.org/10.1016/j.biortech.2007.05.064 . [all data]

Zachariah, Leela, et al., 2008
Zachariah, T.J.; Leela, N.K.; Maya, K.M.; Rema, J.; Mathew, P.A.; Vipin, T.M.; Krishnamoorthy, B., Chemical composition of leaf oils of Myristica beddomeii (King), Myristica fragrans (Houtt.) and Myristica malabarica (Lamk.), J. Spices Arom. Crops, 2008, 17, 1, 10-15. [all data]

Agabriel, Cornu, et al., 2007
Agabriel, C.; Cornu, A.; Journal, C.; Sibra, C.; Groller, C.; MArtin, B., Tanker milk variability according to farm feeding practices: vitamins A and E, carotenoids, color, and terpenoids, J. Dairy Sci., 2007, 90, 10, 4884-4896, https://doi.org/10.3168/jds.2007-0171 . [all data]

Albuquerque, Vasconcelos Silva, et al., 2007
Albuquerque, R.L.; Vasconcelos Silva, M.G.; Machado, M.I.L.; Matos, F.J.A.; Morais, S.M.; Neto, J.S., Chemical composition and antioxidant activity of Plectranthus grandis and P. ornatus essential oils from north-eastern Brazil, Flavour Fragr. J., 2007, 22, 1, 24-26, https://doi.org/10.1002/ffj.1730 . [all data]

Cole, Haber, et al., 2007
Cole, R.A.; Haber, W.A.; Setzer, W.N., Chemical composition of essential oils of seven species of Eugenia from Monteverde, Costa Rica, Biochem. Syst. Ecol., 2007, 35, 12, 877-886, https://doi.org/10.1016/j.bse.2007.06.013 . [all data]

Ferreira, Meireles de Sousa, et al., 2007
Ferreira, N.J.; Meireles de Sousa, I.G.; Luís, T.C.; Currais, A.J.M.; Figueiredo, C.; Cost, M.M.; Lima, A.S.B.; Santos, P.A.G.; Barroso, J.G.; Pedro, L.G.; Scheffer, J.J.C., Pittosporum undulatum Vent. grown in Portugal: secretory structures, seasonal variation and enantiomeric composition of its essential oil, Flavour Fragr. J., 2007, 22, 1, 1-9, https://doi.org/10.1002/ffj.1748 . [all data]

Formisano, Mignola, et al., 2007
Formisano, C.; Mignola, E.; Rigano, D.; Senatore, F.; Bellone, G.; Bruno, M.; Rosselli, S., Chemical composition and antimicrobial activity of the essential oil from aerial parts of Micromeria fruticulosa (Bertol.) Grande (Lamiaceae) growing wild in Southern Italy, Flavour Fragr. J., 2007, 22, 4, 289-292, https://doi.org/10.1002/ffj.1795 . [all data]

Haznagy-Radnai, Szigle, et al., 2007
Haznagy-Radnai, E.; Szigle, Sz.; Mathe, I., Analysis of the essential oil of Downy wounderwort (Stachys Germanica L.), Acta Fac. Pharm. Univer. Comenianae, 2007, 54, 78-83. [all data]

Kamatou, Viljoen, et al., 2007
Kamatou, G.P.P.; Viljoen, A.M.; Figueiredo, A.C.; Tilney, P.M.; Van Zyl, R.L.; Barroso, J.G.; Pedro, L.G.; Van Vuuren, S.F., Trichomes, essential oil composition and biological activities of Salvia albanicus Benth. and S. dolomitica Codd, two species from the Cape region of Soith Africa, South African J. Botany, 2007, 73, 1, 102-108, https://doi.org/10.1016/j.sajb.2006.08.001 . [all data]

Meekijjaroenroj, Bessière, et al., 2007
Meekijjaroenroj, A.; Bessière, J.-M.; Anstett, M.-C., Chemistry of floral scents in four Licuala species (Arecaceae), Flavour Fragr. J., 2007, 22, 4, 300-310, https://doi.org/10.1002/ffj.1797 . [all data]

Mockute, Bernotiene, et al., 2007
Mockute, D.; Bernotiene, G.; Judzentiene, A., The essential oil of Ground Ivy (Glechoma hederaceae L.) growing wild in Eastern Lithuania, J. Essent. Oil Res., 2007, 19, 5, 449-451, https://doi.org/10.1080/10412905.2007.9699948 . [all data]

Moriarity, Bansal, et al., 2007
Moriarity, D.M.; Bansal, A.; Cole, R.A.; Takaku, S.; Haber, W.A.; Setzer, W.N., Selective cytotoxic activities of leaf essential oils from Monteverde Costa Rica, Natural Product Communications, 2007, 2, 12, 1263-1268. [all data]

Moronkola, Ogunwande, et al., 2007
Moronkola, D.O.; Ogunwande, I.A.; Walker, T.M.; Setzer, W.N.; Oyewole, I.O., Identification of the main volatile compounds in the leaf and flower of Tithonia diversifolia (Hemsl) Gray, J. Nat. Med., 2007, 61, 1, 63-66, https://doi.org/10.1007/s11418-006-0019-5 . [all data]

Nivinsliene, Butkiene, et al., 2007
Nivinsliene, O.; Butkiene, R.; Gudalevic, A.; Mockute, D.; Meskauskiene, V.; Grigaliunaite, B., Influence of urban environment on chemical composition of Tilia cordata essential oil, Chemija, 2007, 18, 1, 44-49. [all data]

Ozer H., Sokmen M., et al., 2007
Ozer H.; Sokmen M.; Gulluce M.; Adiguzel A.; Sahin F.; Sokmen A.; Kilic H.; Baris O., Chemical Composition and Antimicrobial and Antioxidant Activities of the Essential Oil and Methanol Extract of Hippomarathrum microcarpum (Bieb.) from Turkey, J. Agric. Food Chem., 2007, 55, 3, 937-942, https://doi.org/10.1021/jf0624244 . [all data]

Pontes, de Olivera, et al., 2007
Pontes, W.J.T.; de Olivera, J.C.G.; da Camara, C.A.G.; Lopes, A.C.H.R.; Gondim Jr.; de Olivera, J.V.; Barros, R.; Schwartz, M.O.E., Chemical composition and acaridical activity of the leaf and fruit essential oils of Protium heptaphyllum (Aubl.) Marchand (Burseraceae), Acta Amazonica, 2007, 37, 1, 103-110, https://doi.org/10.1590/S0044-59672007000100012 . [all data]

Proffit, 2007
Proffit, M., Mediation chimique et structuration des communautes d'hymenopteres parasites du mutualisme figuier / pollinisateur (These pour obtenir le grade de Docteur de l'Universite Montpellier II) (Dissertation), 2007. [all data]

Radusiene, Judzentiene, et al., 2007
Radusiene, J.; Judzentiene, A.; Peciulyte, D.; Janulis, V., Essential Oil Composition and Antimicrobial Assay of Acorus calamus Leaves from Different Wild Populations, Plant Genetic Resources: Characterization and Utilization, 2007, 5, 1, 37-44, https://doi.org/10.1017/S1479262107390928 . [all data]

Rodrigues, Antunes, et al., 2007
Rodrigues, F.S.L.M.; Antunes, L.C.S.; Figueiredo, A.C.; Costa, M.M.; Pereira, J.D.S.; Colaço, R.D.R.; Miranda, H.H.S.; Barroso, J.G.; Pedro, L.G.; Scheffer, J.J.C., Composition of the leaf, flower and fruit volatile oils of Pittosporum tobira (Thunb.) W. T. Aiton grown in three locations in Portugal, Flavour Fragr. J., 2007, 22, 4, 311-316, https://doi.org/10.1002/ffj.1798 . [all data]

Setzer, Stokes, et al., 2007
Setzer, W.N.; Stokes, S.L.; Penton, A.F.; Takaku, S.; Haber, W.A.; Hansell, E.; Caffrey, C.R.; McKerrow, J.H., Cruzain inhibitory activity of leaf essential oils of neotropical Lauraceae and essential oil components, Natural Product Communications, 2007, 2, 12, 1203-1210. [all data]

Soares, Pereira, et al., 2007
Soares, F.D.; Pereira, T.; Marques, M.O.M.; Monteiro, A.R., Volatile and Non-volatile Chemical Composition of the White Guava fruit (Psidium guaiava) at different Stages of Maturity, Food Chem., 2007, 100, 1, 15-21, retrieved from http://www.aseanfood.info/Articles/11016448.pdf, https://doi.org/10.1016/j.foodchem.2005.07.061 . [all data]

Stokes, Cole, et al., 2007
Stokes, S.L.; Cole, R.A.; Rangelova, M.P.; Haber, W.A.; Setzer, W.N., Cruzain inhibitory activity of the leaf essential oil from an undescribed species of Eugenia from Monteverde, Costa Rica, Natural Product Communications, 2007, 2, 12, 1211-1213. [all data]

Suschke, Sporer, et al., 2007
Suschke, U.; Sporer, F.; Schneele, J.; Geiss, H.K.; Reichling, J., Antibacterial and Cytotoxic activity of Nepeta cataria L., Nepeta cataria var. citriodora (Beck.) Balb. and Melissa officinalis L. essential oils, Natural Product Communications, 2007, 2, 12, 1277-1286. [all data]

Takaku, Haber, et al., 2007
Takaku, S.; Haber, W.A.; Setzer, W.N., Leaf essential oil composition of 10 species of Ocotea (Lauraceae) from Monteverde, Costa Rica, Biochem. Syst. Ecol., 2007, 35, 8, 525-532, https://doi.org/10.1016/j.bse.2007.02.003 . [all data]

Chemat, Lucchesi, et al., 2006
Chemat, F.; Lucchesi, M.E.; Smadja, J.; Favretto, L.; Colnaghi, G.; Visinoni, F., Microwave accelerated steam distillation of essential oil from lavender: A rapid, clean and environmentally friendly approach, Anal. Chim. Acta., 2006, 555, 1, 157-160, https://doi.org/10.1016/j.aca.2005.08.071 . [all data]

Deng, Xu, et al., 2006
Deng, C.; Xu, X.; Yao, N.; Li, N.; Zhang, X., Rapid determination of essential oil compounds in Artemisia Selengensis Turcz by gas chromatography-mass spectrometry with microwave distillation and simultaneous solid-phase microextraction, Anal. Chim. Acta., 2006, 556, 2, 289-294, https://doi.org/10.1016/j.aca.2005.09.038 . [all data]

Iriti, Colnaghi, et al., 2006
Iriti, M.; Colnaghi, G.; Chemat, F.; Smadja, J.; Faoro, F.; Visinoni, F.A., Histo-cytochemistry and scanning electron microscopy of lavender glandular trichomes following conventional and microwave-assisted hydrodistillation of essential oils: a comparative study, Flavour Fragr. J., 2006, 21, 4, 704-712, https://doi.org/10.1002/ffj.1692 . [all data]

Judzentiene and Buzelyte, 2006
Judzentiene, A.; Buzelyte, J., Chemical composition of essential oils of Artemisia vulgaris L. (mugwort) from North Lithuania, Chemija, 2006, 17, 1, 12-15. [all data]

Mockute, Bernotiene, et al., 2006
Mockute, D.; Bernotiene, G.; Judzentiene, A., Germacrene D chemotype of essential oils of Leonurus cardiaca L. growing wild in Vilnus district (Lithuania), J. Essent. Oil Res., 2006, 18, 5, 566-568, https://doi.org/10.1080/10412905.2006.9699169 . [all data]

Navickiene, Morandim, et al., 2006
Navickiene, H.M.D.; Morandim, A.A.; Alécio, A.C.; Regasini, L.O.; Bergamo, D.C.B.; Telascrea, M.; Cavalheiro, A.J.; Lopes, M.N.; Bolzani, V.S.; Furlan, M.; Marques, M.O.M.; Young, M.C.M.; Kato, M.J., Composition and antifungal activity of essential oils from Piper aduncum, Piper arboreum and Piper tuberculatum, Quim. Nova, 2006, 29, 3, 467-470, https://doi.org/10.1590/S0100-40422006000300012 . [all data]

Singh G., Maurya S., et al., 2006
Singh G.; Maurya S.; de Lampasona M.P.; Catalan C.A.N., Studies on essential oils, Part 41. Chemical composition, antifungal, antioxidant and sprout suppressant activities of coriander (Coriandrum sativum) essential oil and its oleoresin, Flavour Fragr. J., 2006, 21, 3, 472-479, https://doi.org/10.1002/ffj.1608 . [all data]

Soumaghi, Amin, et al., 2006
Soumaghi, M.H.S.; Amin, G.; Samadi, N., Chemical composition and antimicrobial activity of essential oil of Salvia spinosa L., Asian J. Plant Sci., 2006, 5, 4, 654-656, https://doi.org/10.3923/ajps.2006.654.656 . [all data]

Srivastava, Mallavarapu, et al., 2006
Srivastava, S.; Mallavarapu, G.R.; Rai, S.K.; Singh, D.; Mishra, R.; Pandey-Rai, S.; Kumar, S., Composition of the essential oils of the leaves and flowers of Rhus mysurensis Heyne ex Wight Arn growing in the Aravalli mountain range at New Delhi, Flavour Fragr. J., 2006, 21, 2, 228-229, https://doi.org/10.1002/ffj.1561 . [all data]

Tognolini, Barocelli, et al., 2006
Tognolini, M.; Barocelli, E.; Ballabeni, V.; Bruni, R.; Bianchi, A.; Chiavarini, M.; Impicciatore, M., Comparative screening of plant essential oils: Phenylpropanoid moiety as basic core for antiplatelet activity, Life Sciences, 2006, 78, 13, 1419-1432, https://doi.org/10.1016/j.lfs.2005.07.020 . [all data]

Xie, Sun, et al., 2006
Xie, J.; Sun, B.; Yu, M., Constituents of top fragrance from fresh flowers of Robinia Pseudoacacia L. occurring in China, Flavour Fragr. J., 2006, 21, 5, 798-800, https://doi.org/10.1002/ffj.1720 . [all data]

Belhattab, Larous, et al., 2005
Belhattab, R.; Larous, L.; Figueiredo, A.C.; Santos, P.A.G.; Barroso, J.G.; Pedro, L.G., Origanum glandulosum Desf. grown wild in Algeria: essential oil composition and glycosidic bound volatiles, Flavour Fragr. J., 2005, 20, 2, 209-212, https://doi.org/10.1002/ffj.1387 . [all data]

Cysne, Canuto, et al., 2005
Cysne, J.B.; Canuto, K.M.; Pessoa, O.D.L.; Nunes, E.P.; Silveira, E.R., Leaf essential oils of four Piper species from the State of Ceará - Northeast of Brazil, J. Braz. Chem. Soc., 2005, 16, 6B, 1378-1381, https://doi.org/10.1590/S0103-50532005000800012 . [all data]

Faleio, Miguel, et al., 2005
Faleio, L.; Miguel, G.; Gomes, S.; Costa, L.; Venancio, F.; Teixeira, A.; Figueiredo, A.C.; Barroso, J.G.; Pedro, L.G., Antibacterial and Antioxidant Activities of Essential Oils Isolated from Thymbra capitata L. (Cav.) and Origanum vulgare L., J. Agric. Food Chem., 2005, 53, 21, 8162-8168, https://doi.org/10.1021/jf0510079 . [all data]

Figueiredo, Sim-Sim, et al., 2005
Figueiredo, A.C.; Sim-Sim, M.; Costa, M.M.; Barroso, J.G.; Pedro, L.G.; Esquível, M.G.; Gutierres, F.; Lobo, C.; Fontinha, S., Comparison of the essential oil composition of four Plagiochila species: P. bifaria, P. maderensis, P. retrorsa and P. stricta, Flavour Fragr. J., 2005, 20, 6, 703-709, https://doi.org/10.1002/ffj.1627 . [all data]

Himanen, Vuorinen, et al., 2005
Himanen, S.; Vuorinen, T.; Tuovinen, T.; Holopainen, J.K., Effects of Cyclamen Mite (Phytonemus pallidus) and Leaf Beetle (Galerucella tenella) Damage on Volatile Emission from Strawberry (Fragaria ´ ananassa Duch.) Plants and Orientation of Predatory Mites (Neoseiulus cucumeris, N. californicus, and Euseius finlandicus), J. Agric. Food Chem., 2005, 53, 8624-8630. [all data]

Kordali, Kotan, et al., 2005
Kordali, S.; Kotan, R.; Mavi, A.; Cakir, A.; Ala, A.; Yildirim, A., Determination of the chemical composition and antioxidant activity of the essential oil of Artemisia dracunculus and of the antifungal and antibacterial activities of Turkish Artemisia absinthium, A. dracunculus, Artemisia santonicum, and Artemisia spicigera essential oils, J. Agric. Food Chem., 2005, 53, 9452-9458. [all data]

Koutsoudaki, Krsek, et al., 2005
Koutsoudaki, C.; Krsek, M.; Rodger, A., Chemical composition and antibacterial activity of the essential oil and the gum of pistacia lentiscus Var. chia, J. Agric. Food Chem., 2005, 53, 20, 7681-7685, https://doi.org/10.1021/jf050639s . [all data]

Radudienë, Judpintienë, et al., 2005
Radudienë, J.; Judpintienë, A.; Peèiulytë, D.; Janulis, V., Chemical composition of essential oil and antimicrobial activity of Origanum vulgare, Biologija, 2005, 4, 53-58. [all data]

Singh, Maurya, et al., 2005
Singh, G.; Maurya, S.; Catalan, C.; de Lampasona, M.P., Studies on essential oils, Part 42: chemical, antifungal, antioxidant and sprout suppressant studies on ginger essential oil and its oleoresin, Flavour Fragr. J., 2005, 20, 1, 1-6, https://doi.org/10.1002/ffj.1373 . [all data]

Albuquerque, Souza, et al., 2004
Albuquerque, M.R.J.R.; Souza, E.B.; Lins, M.U.D.S.; Nogueira, N.A.P.; Lemos, T.L.G.; Silveira, E.R.; Pessoa, O.D.L., Composition and antimicrobial activity of the essential oil from aerial parts of Baccharis trinervis (Lam.) Pers., Arkivoc, 2004, 6, 6, 59-65, https://doi.org/10.3998/ark.5550190.0005.608 . [all data]

Cavalcanti, de Morais, et al., 2004
Cavalcanti, E.S.B.; de Morais, S.M.; Lima, M.A.A.; Santana, E.W.P., Larvicidal activity of essential oils from Brazilian plants against Aedes aegypti L., Mem. Inst. Oswaldo Cruz., 2004, 99, 5, 541-544, https://doi.org/10.1590/S0074-02762004000500015 . [all data]

Judpentienë and Mockutë, 2004
Judpentienë, A.; Mockutë, D., Chemical composition of essential oils of Artemisia absinthium L. (wormwood) growing wild in Vilnius, Chemija, 2004, 15, 4, 64-68. [all data]

Miguel, Simões, et al., 2004
Miguel, G.; Simões, M.; Figueiredo, A.C.; Barroso, J.G.; Pedro, L.G.; Carvalho, L., Composition and antioxidant activities of the essential oils of Thymus caespititius, Thymus camphoratus and Thymus mastichina, Food Chem., 2004, 86, 2, 183-188, https://doi.org/10.1016/j.foodchem.2003.08.031 . [all data]

Mockutë, Bernotienë, et al., 2004
Mockutë, D.; Bernotienë, G.; Judbentienë, A., Chemical composition of essential oils of Origanum vulgare L. growing in Lithuania, Biologija, 2004, 4, 44-49. [all data]

Mockutë, Judbentienë, et al., 2004
Mockutë, D.; Judbentienë, A.; Bernotienë, G., Volatile constituents of cultivated Origanum vulgare L. inflorescences and leaves, Chemija, 2004, 15, 1, 33-37. [all data]

Sahin, Gulluce, et al., 2004
Sahin, F.; Gulluce, M.; Daferera, D.; Sokmen, A.; Sokmen, M.; Polissiou, M.; Agar, G.; Ozer, H., Biological activities of the essential oils and methanol extract of Origanum vulgare ssp. vulgare in the Eastern Anatolia region of Turkey, Food Control, 2004, 15, 7, 549-557, https://doi.org/10.1016/j.foodcont.2003.08.009 . [all data]

Silva, Matos, et al., 2004
Silva, M.G. deV.; Matos, F.J. de.A.; Lopes, P.R.O.; Silva, F.O.; Holanda, M.T., Composition of Essential Oils from Three Ocimum Species Obtained by Steam and Microwave Distillation and Supercritical CO2 Extraction, ARKIVOS, 2004, 6, 6, 66-71, https://doi.org/10.3998/ark.5550190.0005.609 . [all data]

Tepe, Donmez, et al., 2004
Tepe, B.; Donmez, E.; Unlu, M.; Candan, F.; Daferera, D.; Vardar-Unlu, G.; Polissiou, M.; Sokmen, A., Antimicrobial and antioxidative activities of the essential oils and methanol extracts of Salvia cryptantha (Montbret et Aucher ex Benth.) and Salvia multicaulis (Vahl), Food Chem., 2004, 84, 4, 519-525, https://doi.org/10.1016/S0308-8146(03)00267-X . [all data]

Vilaseca, Guy, et al., 2004
Vilaseca, A.; Guy, I.; Charles, B.; Guinaudeau, H.; de Arias, A.R.; Fournet, A., Chemical composition and insecticidal activity of Hedeoma mandoniana essential oils, J. Essent. Oil Res., 2004, 16, 4, 380-383, https://doi.org/10.1080/10412905.2004.9698749 . [all data]

Vinogradov, 2004
Vinogradov, B.A., Production, composition, properties and application of essential oils, 2004, retrieved from http://viness.narod.ru. [all data]

Jordán, Margaría, et al., 2003
Jordán, M.J.; Margaría, C.A.; Shaw, P.E.; Goodner, K.L., Volatile components and aroma active compounds in aqueous essence and fresh pink guava fruid puree (Psidium guajava L.) by GC-MS and multidimensional GC/GC-O, J. Agric. Food Chem., 2003, 51, 5, 1421-1426, https://doi.org/10.1021/jf020765l . [all data]

Mockute, Bernotiene, et al., 2003
Mockute, D.; Bernotiene, G.; Judzentiene, A., The β-ocimene chemotype of essential oils of the inflorescences and the leaves with stems from Origanum vulgare ssp. vulgare growing wild in Lithuania, Biochem. Syst. Ecol., 2003, 31, 3, 269-278, https://doi.org/10.1016/S0305-1978(02)00151-5 . [all data]

Singh, Singh, et al., 2003
Singh, G.; Singh, O.P.; de Lampasona, M.P.; Catalán, C.A.N., Studies on essential oils. Part 35: chemical and biocidal investigations on Tagetes erecta leaf volatile oil, Flavour Fragr. J., 2003, 18, 1, 62-65, https://doi.org/10.1002/ffj.1158 . [all data]

Veres, Varga, et al., 2003
Veres, K.; Varga, E.; Dobos, Á.; Hajdú, Zs.; Máthé, I.; Németh, É.; Szabó, K., Investigation of the composition and stability of the essential oils of origanum vulgare ssp. vulgare L. and O. vulgare ssp. hirtum (Link) letswaart, Chromatographia, 2003, 57, 1/2, 95-98, https://doi.org/10.1007/BF02497483 . [all data]

Kilic, 2002
Kilic, A., Volatile compounds of buds, flowers and fruits of bay (Laurus nobilis L.) and their odour contribution, Proc. ICNP-2002 - Trabzon/Turkiye, 2002, 338-341. [all data]

Nogueira and Romano, 2002
Nogueira, J.M.F.; Romano, A., Essential oils from micropropagated plants of Lavandula viridis, Phytochem. Anal., 2002, 13, 1, 4-7, https://doi.org/10.1002/pca.609 . [all data]

Pessoa, Morais, et al., 2002
Pessoa, L.M.; Morais, S.M.; Bevilaqua, C.M.L.; Luciano, J.H.S., Anthelmintic activity of essential oil of Ocimum gratissimum Linn. and eugenol against Haemonchus contortus, Vet. Parasitol., 2002, 109, 1-2, 59-63, https://doi.org/10.1016/S0304-4017(02)00253-4 . [all data]

Viana, Andrade-Neto, et al., 2002
Viana, F.A.; Andrade-Neto, M.; Pouliquen, Y.B.M.; Uchoa, D.E.A.; Sobral, M.M.S.Z.; de Morais, S.M., Essential oil of Siparuna guianensis aublet from the Amazon region of Brazil, J. Essent. Oil Res., 2002, 14, 1, 60-62, https://doi.org/10.1080/10412905.2002.9699765 . [all data]

Aparicio, Romero, et al., 2001
Aparicio, R.; Romero, M.; Rojas, L.B.; Khouri, N.; Usubillaga, A., Composition of the essential oil of four species of Ruilopezia from the Venezuelan Andes, Flavour Fragr. J., 2001, 16, 3, 172-174, https://doi.org/10.1002/ffj.973 . [all data]

Duckham, Dodson, et al., 2001
Duckham, S.C.; Dodson, A.T.; Bakker, J.; Ames, J.M., Volatile flavour components of baked potato flesh. A comparison of eleven potato cultivars, Nahrung/Food, 2001, 45, 5, 317-323, https://doi.org/10.1002/1521-3803(20011001)45:5<317::AID-FOOD317>3.0.CO;2-4 . [all data]

Ferreira, Costantin, et al., 2001
Ferreira, M.J.P.; Costantin, M.B.; Sartorelli, P.; Rodrigues, G.V.; Limberger, R.; Henriques, A.T.; Kato, M.J.; Emerenciano, V.P., Computer-aided method for identification of components in essential oils by 13C NMR spectroscopy, Anal. Chim. Acta., 2001, 447, 1-2, 125-134, https://doi.org/10.1016/S0003-2670(01)01204-1 . [all data]

Figueiredo, Miguel, et al., 2001
Figueiredo, A.C.; Miguel, M.G.; Duarte, A.M.F.; Barroso, J.G.; Pedro, L.G., Essential oil composition of Thymus lotocephallus G. López R. Morales, collected during flowering and vegetative phases, Flavour Fragr. J., 2001, 16, 6, 417-421, https://doi.org/10.1002/ffj.1028 . [all data]

Shang, Hu, et al., 2001
Shang, C.; Hu, Y.; Deng, C.; Hu, K., Rapid determination of volatile constituents of Michelia alba flowers by gas chromatography - mass spectrometry with solid-phase microextraction, J. Chromatogr. A, 2001, 942, 1-2, 283-288, https://doi.org/10.1016/S0021-9673(01)01382-6 . [all data]

Usubillaga, Aparicio, et al., 2001
Usubillaga, A.; Aparicio, R.; Romero, M.; Rojas, L.B.; Khouri, N., Volatile constituents from the leaves of four Libanothamus species from the Venezuelan Andes, Flavour Fragr. J., 2001, 16, 3, 209-211, https://doi.org/10.1002/ffj.981 . [all data]

Andrade, Maia, et al., 2000
Andrade, E.H.A.; Maia, J.G.S.; Zoghbi, M.G.B., Aroma volatile constituents of Brazilian varieties of mango fruit, J. Food Comp. Anal., 2000, 13, 1, 27-33, https://doi.org/10.1006/jfca.1999.0841 . [all data]

Juliani, Biurrun, et al., 2000
Juliani, H.R., Jr.; Biurrun, F.; Koroch, A.R.; Juliani, H.R.; Zygadlo, J.A., Chemical constituents of the essential oil of Lippia laxibracteata (Verbenaceae), Planta Med., 2000, 66, 6, 567-568, https://doi.org/10.1055/s-2000-8612 . [all data]

da Silva, Pedro, et al., 2000
da Silva, J.A.; Pedro, L.G.; Santos, P.A.G.; Figueiredo, A.C.; Barroso, J.G.; Tenreiro, R.P.; Ribeiro, C.A.; Deans, S.G.; Looman, A.; Scheffer, J.J.C., Essential oils from seven populations of Juniperus brevifolia (Seub.) Antoine, an endemic species of the Azores, Flavour Fragr. J., 2000, 15, 1, 31-39, https://doi.org/10.1002/(SICI)1099-1026(200001/02)15:1<31::AID-FFJ862>3.0.CO;2-C . [all data]

Pedro, da Silva, et al., 1999
Pedro, L.G.; da Silva, J.A.; Barroso, J.G.; Figueiredo, A.C.; Deans, S.G.; Looman, A.; Scheffer, J.J.C., Composition of the essential oil fo Chaerophyllum azoricum Trel., an endemic species of the Azores archipelago, Flavour Fragr. J., 1999, 14, 5, 287-289, https://doi.org/10.1002/(SICI)1099-1026(199909/10)14:5<287::AID-FFJ827>3.0.CO;2-O . [all data]

Prikhod'ko, Klyuev, et al., 1999
Prikhod'ko, A.B.; Klyuev, N.A.; Volkovich, S.V.; Emets, T.I.; Petrenko, V.V.; Dolya, E.V., Component composition od the essential oil of Thymus dimorphus, Chem. Nat. Comp., 1999, 35, 1, 46-51, https://doi.org/10.1007/BF02238208 . [all data]

Santos, Figueiredo, et al., 1999
Santos, P.A.; Figueiredo, A.C.; Barroso, J.G.; Pedro, L.G.; Scheffer, J.J.C., Composition of the essential oil of Hypericum foliosum Aiton from five Azorean islands, Flavour Fragr. J., 1999, 14, 5, 283-286, https://doi.org/10.1002/(SICI)1099-1026(199909/10)14:5<283::AID-FFJ826>3.0.CO;2-2 . [all data]

Yen and Lin, 1999
Yen, G.-C.; Lin, H.-T., Changes in volatile flavor components of guava juice with high-pressure treatment and heat processing and during storage, J. Agric. Food Chem., 1999, 47, 5, 2082-2087, https://doi.org/10.1021/jf9810057 . [all data]

Baratta, Dorman, et al., 1998
Baratta, M.T.; Dorman, H.J.; Deans, S.G.; Figueiredo, A.C.; Barroso, J.G.; Ruberto, G., Antimicrobial and antioxidant properties of some commercial essential oils, Flavour Fragr. J., 1998, 13, 4, 235-244, https://doi.org/10.1002/(SICI)1099-1026(1998070)13:4<235::AID-FFJ733>3.0.CO;2-T . [all data]

Kökdil, 1998
Kökdil, G., Composition of the essential oil of Clinopodium vulgare L. ssp. arundanum (Boiss.) Nyman collected from two different localities in Turkey, Flavour Fragr. J., 1998, 13, 3, 170-172, https://doi.org/10.1002/(SICI)1099-1026(199805/06)13:3<170::AID-FFJ721>3.0.CO;2-H . [all data]

Sanda, Koba, et al., 1998
Sanda, K.; Koba, K.; Nambo, P.; Gaset, A., Chemical investigation of Ocimum species growing in Togo, Flavour Fragr. J., 1998, 13, 4, 226-232, https://doi.org/10.1002/(SICI)1099-1026(1998070)13:4<226::AID-FFJ717>3.0.CO;2-H . [all data]

Yusuf, Begum, et al., 1998
Yusuf, M.; Begum, J.; Mondello, L.; Stagno d'Alcontres, I.S., Studies on the essential oil bearing plants of Bangladesh. Part VI. Composition of the oil of Ocimum gratissimum L., Flavour Fragr. J., 1998, 13, 3, 163-166, https://doi.org/10.1002/(SICI)1099-1026(199805/06)13:3<163::AID-FFJ714>3.0.CO;2-1 . [all data]

Figueiredo, Barroso, et al., 1997
Figueiredo, A.C.; Barroso, J.G.; Pedro, L.G.; Fontinha, S.S.; Looman, A.; Scheffer, J.J.C., Composition of the essential oil of Monizia edulis Lowe, an endemic species of the Madeira Archipelago, Flavour Fragr. J., 1997, 12, 1, 29-31, https://doi.org/10.1002/(SICI)1099-1026(199701)12:1<29::AID-FFJ607>3.0.CO;2-K . [all data]

Isidorov, Zenkevich, et al., 1997
Isidorov, V.; Zenkevich, I.; Sacharevich, T., Calculation of Gas Chromatographic Retention Indices for Monoterpenes and Terpenoids from Their Physico-Chemical Constants, Chem. Anal. (Warsaw), 1997, 42, 627-634. [all data]

Mariaca, Berger, et al., 1997
Mariaca, R.G.; Berger, T.F.H.; Gauch, R.; Imhof, M.I.; Jeangros, B.; Bosset, J.O., Occurrence of volatile mono- and sesquiterpenoids in highland and lowland plant species as possible precursors for flavor compounds in milk and dairy products, J. Agric. Food Chem., 1997, 45, 11, 4423-4434, https://doi.org/10.1021/jf970216t . [all data]

Barroso, Figueiredo, et al., 1996
Barroso, J.G.; Figueiredo, A.C.; Pedro, L.G.; Antunes, T.; Sevinate-Pinto, I.; Fontinha, S.S.; Scheffer, J.J.C., Composition of the essential oil of teucrium heterophyllum L'Her. Grown on Madiera, Flavour Fragr. J., 1996, 11, 2, 129-132, https://doi.org/10.1002/(SICI)1099-1026(199603)11:2<129::AID-FFJ550>3.0.CO;2-Z . [all data]

de Morais, Craveiro, et al., 1996
de Morais, S.M.; Craveiro, A.A.; Machado, M.I.L.M.; Alencar, J.W.; Matos, J.A., Volatile constituents of Eugenia unifluora leaf oil from Notheastern Brazil, J. Ess. Oil Res., 1996, 8, 4, 449-451, https://doi.org/10.1080/10412905.1996.9700664 . [all data]

Zenkevich, 1996
Zenkevich, I.G., Analytical Parameters of Components of Essential Oils for their Chromatographic and Chromato-Mass Spectral Identification. Mono- and Sesquiterpenes, Rastitelnye Resursy (Plant resources), 1996, 34, 1-2, 48-58. [all data]

Binder and Flath, 1989
Binder, R.G.; Flath, R.A., Volatile components of pineapple guava, J. Agric. Food Chem., 1989, 37, 3, 734-736, https://doi.org/10.1021/jf00087a034 . [all data]

Miller, Bills, et al., 1989
Miller, R.L.; Bills, D.D.; Buttery, R.G., Volatile components from Barlett and Bradford pear leaves, J. Agric. Food Chem., 1989, 37, 6, 1476-1479, https://doi.org/10.1021/jf00090a005 . [all data]

Takeoka, Flath, et al., 1988
Takeoka, G.R.; Flath, R.A.; Güntert, M.; Jennings, W., Nectarine volatiles: vacuum steam distillation versus headspace sampling, J. Agric. Food Chem., 1988, 36, 3, 553-560, https://doi.org/10.1021/jf00081a037 . [all data]

De Pooter and Schamp, 1987
De Pooter, H.L.; Schamp, N.M., The Essential Oil of Mentha X villosa nm. alopecuroides, Flavour Fragr. J., 1987, 2, 4, 163-165, https://doi.org/10.1002/ffj.2730020405 . [all data]

Shibamoto, 1987
Shibamoto, T., Retention Indices in Essential Oil Analysis in Capillary Gas Chromatography in Essential Oil Analysis, Sandra, P.; Bicchi, C., ed(s)., Hutchig Verlag, Heidelberg, New York, 1987, 259-274. [all data]

Swigar and Silverstein, 1981
Swigar, A.A.; Silverstein, R.M., Monoterpenes, Aldrich Chemical Company, Milwaukee, WI, USA, 1981, 130. [all data]