2-Propanamine, N-(1-methylethylidene)-

Gas phase ion energetics data

Data compiled by: Sharon G. Lias, Rhoda D. Levin, and Sherif A. Kafafi

Ionization energy determinations

IE (eV) Method Reference
8.4 ± 0.2EILeduc and Rousseau, 1974

References

Leduc and Rousseau, 1974
Leduc, G.; Rousseau, Y., Spectrometrie de masse d'imines aliphatiques, Can. J. Chem., 1974, 52, 1648. [all data]