Glycine, N,N-dimethyl-, ethyl ester

Phase change data

Data compiled as indicated in comments:
BS - Robert L. Brown and Stephen E. Stein
ALS - Hussein Y. Afeefy, Joel F. Liebman, and Stephen E. Stein

Quantity Value Units Method Reference Comment
Tboil423.7KN/AAldrich Chemical Company Inc., 1990BS
Quantity Value Units Method Reference Comment
Δvap47.6 ± 0.8kJ/molVVerevkin, Beckhaus, et al., 1992ALS

References

Aldrich Chemical Company Inc., 1990
Aldrich Chemical Company Inc., Catalog Handbook of Fine Chemicals, Aldrich Chemical Company, Inc., Milwaukee WI, 1990, 1. [all data]

Verevkin, Beckhaus, et al., 1992
Verevkin, S.P.; Beckhaus, H.-D.; Ruchardt, C., Geminale substituenteneffekte Teil 5α. Standardbildungsenthalpien von alkylsubstituierten Malonsaure- und α-aminocarbonsaureestern, Thermochim. Acta, 1992, 197, 27-39. [all data]