Methyl palustrate

Kovats' RI, polar column, isothermal

Data compiled by: NIST Mass Spectrometry Data Center, William E. Wallace, director

Column type PackedPacked
Active phase Carbowax 20MCarbowax 20M
Column length (m) 2.52.5
Carrier gas
Substrate Chromaton N-AW-DMCSChromaton N-AW-DMCS
Column diameter (mm)
Phase thickness (μm)
Temperature (C) 190.200.
I 2875.2876.
ReferenceKosyukova and Khorguani, 1989Kosyukova and Khorguani, 1989
Comment MSDC-RI MSDC-RI

Kovats' RI, non-polar column, isothermal

View large format table.

Column type Active phase Temperature (C) I Reference Comment
PackedOV-101200.2271.Kosyukova and Khorguani, 1989Chromaton N-AW-DMCS; Column length: 2.5 m
PackedOV-101210.2284.Kosyukova and Khorguani, 1989Chromaton N-AW-DMCS; Column length: 2.5 m

References

Kosyukova and Khorguani, 1989
Kosyukova, L.V.; Khorguani, T.V., Retention indices of diterpenes isolated from resins of coniferous trees, Zh. Anal. Khim., 1989, 44, 9, 1309-1313. [all data]