5-Undecanone

Phase change data

Data compiled as indicated in comments:
BS - Robert L. Brown and Stephen E. Stein
TRC - Thermodynamics Research Center, NIST Boulder Laboratories, Chris Muzny director

Quantity Value Units Method Reference Comment
Tfus275.KN/AVon Braun and Kroper, 1929Uncertainty assigned by TRC = 4. K; TRC
Quantity Value Units Method Reference Comment
Tc679.4KN/APulliam, Gude, et al., 1995Uncertainty assigned by TRC = 1.5 K; TRC
Quantity Value Units Method Reference Comment
ρc1.44mol/lN/APulliam, Gude, et al., 1995Uncertainty assigned by TRC = 0.04 mol/l; TRC

Reduced pressure boiling point

Tboil (K) Pressure (bar) Reference Comment
378.80.016Weast and Grasselli, 1989BS

In addition to the Thermodynamics Research Center (TRC) data available from this site, much more physical and chemical property data is available from the following TRC products:

References

Von Braun and Kroper, 1929
Von Braun, J.; Kroper, Chem. Ber., 1929, 62, 2880. [all data]

Pulliam, Gude, et al., 1995
Pulliam, M.K.; Gude, M.T.; Teja, A.S., Critical Temperatures and Densities of n-Alkanones, J. Chem. Eng. Data, 1995, 40, 455-8. [all data]

Weast and Grasselli, 1989
CRC Handbook of Data on Organic Compounds, 2nd Editon, Weast,R.C and Grasselli, J.G., ed(s)., CRC Press, Inc., Boca Raton, FL, 1989, 1. [all data]