1,3-Dioxolane, 2,4,5-trimethyl-

Van Den Dool and Kratz RI, non-polar column, custom temperature program

View large format table.

Column type Active phase I Reference Comment
CapillaryDB-5745.Sampaio and Nogueira, 200630. m/0.25 mm/0.25 μm; Program: 40C(2min) => 4C/min => 220C => 20C/min => 280C

Normal alkane RI, non-polar column, temperature ramp

View large format table.

Column type Active phase I Reference Comment
CapillaryRTX-5739.Setkova, Risticevic, et al., 200710. m/0.18 mm/0.2 μm, He, 40. C @ 0.5 min, 50. K/min, 275. C @ 0.5 min
CapillaryRSL-200710.Ngassoum, Jirovetz, et al., 200130. m/0.32 mm/0.25 μm, H2, 40. C @ 5. min, 6. K/min, 280. C @ 5. min

Normal alkane RI, non-polar column, custom temperature program

View large format table.

Column type Active phase I Reference Comment
CapillaryPolydimethyl siloxane with 5 % Ph groups735.Robinson, Adams, et al., 2012Program: not specified
CapillaryPolydimethyl siloxane with 5 % Ph groups745.Robinson, Adams, et al., 2012Program: not specified
CapillaryHP-5752.Rotsatschakul, Visesanguan, et al., 200960. m/0.25 mm/0.25 μm, Helium; Program: 30 0C (2 min) 2 0Cmin -> 60 0C 10 0C/min -> 100 0C 20 0C/min -> 140 0C 10 0C/min -> 200 0C (10 min)

Normal alkane RI, polar column, temperature ramp

View large format table.

Column type Active phase I Reference Comment
CapillarySupelcowax-10967.Korány, Mednyánszky, et al., 200060. m/0.25 mm/0.25 μm, He, 4. K/min; Tstart: 60. C; Tend: 280. C

Normal alkane RI, polar column, custom temperature program

View large format table.

Column type Active phase I Reference Comment
CapillaryCarbowax 20M1020.Vinogradov, 2004Program: not specified

References

Sampaio and Nogueira, 2006
Sampaio, T.S.; Nogueira, P.C.L., Volatile components of mangaba fruit (Hancornia speciosa Gomes) at three stages of maturity, Food Chem., 2006, 95, 4, 606-610, https://doi.org/10.1016/j.foodchem.2005.01.038 . [all data]

Setkova, Risticevic, et al., 2007
Setkova, L.; Risticevic, S.; Pawliszyn, J., Rapid headspace solid-phase microextraction-gas chromatographic?time-of-flight mass spectrometric method for qualitative profiling of ice wine volatile fraction II: Classification of Canadian and Czech ice wines using statistical evaluation of the data, J. Chromatogr. A, 2007, 1147, 2, 224-240, https://doi.org/10.1016/j.chroma.2007.02.052 . [all data]

Ngassoum, Jirovetz, et al., 2001
Ngassoum, M.B.; Jirovetz, L.; Buchbauer, G., SPME/GC/MS analysis of headspace aroma compounds of the Cameroonian fruit Tetrapleura tetraptera (Thonn.) Taub., Eur. Food Res. Technol., 2001, 213, 1, 18-21, https://doi.org/10.1007/s002170100330 . [all data]

Robinson, Adams, et al., 2012
Robinson, A.L.; Adams, D.O.; Boss, P.K.; Heymann, H.; Solomon, P.S.; Trengove, R.D., Influence of geographic origine on the sensory characteristics and wine composition of Vitus viniferas cv. Cabernet Sauvignon wines from Australia (Supplemental data), Am. J. Enol. Vitic., 2012, 64, 4, 467-476, https://doi.org/10.5344/ajev.2012.12023 . [all data]

Rotsatschakul, Visesanguan, et al., 2009
Rotsatschakul, P.; Visesanguan, W.; Smitinont, T.; Chaiseri, S., Changes in volatile compounds during fermentation of nham (Thai fermented sausage), Int. Food Res. J., 2009, 16, 391-414. [all data]

Korány, Mednyánszky, et al., 2000
Korány, K.; Mednyánszky, Zs.; Amtmann, M., Preliminary results of a recognition method visualizing the aroma and fragrance features, Acta Aliment., 2000, 29, 2, 187-198, https://doi.org/10.1556/AAlim.29.2000.2.9 . [all data]

Vinogradov, 2004
Vinogradov, B.A., Production, composition, properties and application of essential oils, 2004, retrieved from http://viness.narod.ru. [all data]