1,3-Propanediol, 2,2-bis(bromomethyl)-

Phase change data

Data compiled by: William E. Acree, Jr., James S. Chickos

Enthalpy of fusion

ΔfusH (kJ/mol) Temperature (K) Reference
30.1387.3Dou, Fuess, et al., 1996

References

Dou, Fuess, et al., 1996
Dou, S.-Q.; Fuess, H.; Strau, R.; Weiss, A., On the structure of some pentaerythritol-related molecular crystals with pseudotetrahedral molecular structure. Ordered structure of 2,2-bis (bromomethyl)-1,3-propanediol and orientationally disordered structure of 2-chloromethyl-2-methyl-1,3-dichloropropane; Cl-35 NQR, Z. Naturforsch., A: Phys. Sci., 1996, 51, 5-6, 777. [all data]