Glycerol cis-6-octadecenoate

Reaction thermochemistry data

Data compiled by: Hussein Y. Afeefy, Joel F. Liebman, and Stephen E. Stein

Individual Reactions

3Hydrogen + Glycerol cis-6-octadecenoate = Tristearin

By formula: 3H2 + C57H104O6 = C57H110O6

Quantity Value Units Method Reference Comment
Δr-378.05kJ/molChydRogers and Choudhury, 1978liquid phase; solvent: Hexane

References

Rogers and Choudhury, 1978
Rogers, D.W.; Choudhury, D.N., Heats of hydrogenation of large molecules. Part 3 - Five simple unsaturated triglycerides (triacylglycerols), J. Chem. Soc. Faraday Trans. 1, 1978, 74, 2868-2872. [all data]