Allyl n-octyl ether

Phase change data

Data compiled by: Thermodynamics Research Center, NIST Boulder Laboratories, Chris Muzny director

Quantity Value Units Method Reference Comment
Tboil479.2KN/ADevaney and Panian, 1953Uncertainty assigned by TRC = 1. K
Quantity Value Units Method Reference Comment
Tfus212.2KN/ADevaney and Panian, 1953Uncertainty assigned by TRC = 1. K

In addition to the Thermodynamics Research Center (TRC) data available from this site, much more physical and chemical property data is available from the following TRC products:

References

Devaney and Panian, 1953
Devaney, L.W.; Panian, G.W., Preparation and properties of some octyl ethers, J. Am. Chem. Soc., 1953, 75, 4836-7. [all data]