5-Methylcytosine, 2TMS derivative

Kovats' RI, non-polar column, custom temperature program

Data compiled by: NIST Mass Spectrometry Data Center, William E. Wallace, director

Column type PackedPackedPackedPackedPacked
Active phase OV-1OV-1OV-1OV-1OV-1
Column length (m) 1.1.1.1.1.
Carrier gas
Substrate Gas Chrom QGas Chrom QGas Chrom QGas Chrom QGas Chrom Q
Column diameter (mm)
Phase thickness (μm)
Program not specifiednot specifiednot specifiednot specifiednot specified
I 1533.1533.1537.1537.1537.
ReferenceYamaji, Kimura, et al., 1978Yamaji, Kimura, et al., 1978Yamaji, Kimura, et al., 1978Yamaji, Kimura, et al., 1978Yamaji, Kimura, et al., 1978
Comment MSDC-RI MSDC-RI MSDC-RI MSDC-RI MSDC-RI
Column type PackedPacked
Active phase OV-1OV-1
Column length (m) 1.1.
Carrier gas
Substrate Gas Chrom QGas Chrom Q
Column diameter (mm)
Phase thickness (μm)
Program not specifiednot specified
I 1538.1533.
ReferenceYamaji, Kimura, et al., 1978Yamaji, Kimura, et al., 1978
Comment MSDC-RI MSDC-RI

References

Yamaji, Kimura, et al., 1978
Yamaji, A.; Kimura, S.; Kawasaki, H.; Yuki, H., Gas chromatographic analysis of pyrimidine and purine bases by retention indices, Yakugaku Zasshi, 1978, 98, 1, 1536-1541. [all data]