2-Oxopentanedioic acid

Phase change data

Data compiled as indicated in comments:
TRC - Thermodynamics Research Center, NIST Boulder Laboratories, Chris Muzny director
AC - William E. Acree, Jr., James S. Chickos

Quantity Value Units Method Reference Comment
Tfus390.9KN/AWilhoit and Lei, 1965Uncertainty assigned by TRC = 1. K; TRC
Tfus388.45KN/AWilhoit and Lei, 1965Uncertainty assigned by TRC = 1.5 K; TRC

Enthalpy of sublimation

ΔsubH (kJ/mol) Temperature (K) Method Reference Comment
100.269. - 285.TPTDChattopadhyay and Ziemann, 2005Values based on TPTD method are not consistent with values determined by other experimental methods; AC

Enthalpy of fusion

ΔfusH (kJ/mol) Temperature (K) Method Reference Comment
28.59388.7DSCContineanu, Chivu, et al., 2005AC

In addition to the Thermodynamics Research Center (TRC) data available from this site, much more physical and chemical property data is available from the following TRC products:

References

Wilhoit and Lei, 1965
Wilhoit, R.C.; Lei, I., Thermochemistry of Biologically Important Compounds. Heats of Combustion of Five Organic Acids, J. Chem. Eng. Data, 1965, 10, 166. [all data]

Chattopadhyay and Ziemann, 2005
Chattopadhyay, Sulekha; Ziemann, Paul J., Vapor Pressures of Substituted and Unsubstituted Monocarboxylic and Dicarboxylic Acids Measured Using an Improved Thermal Desorption Particle Beam Mass Spectrometry Method, Aerosol Science and Technology, 2005, 39, 11, 1085-1100, https://doi.org/10.1080/02786820500421547 . [all data]

Contineanu, Chivu, et al., 2005
Contineanu, I.; Chivu, L.; Perisanu, S., Revista di Chim., 2005, 56, 7, 719. [all data]