D-Leucine

Condensed phase thermochemistry data

Data compiled by: Hussein Y. Afeefy, Joel F. Liebman, and Stephen E. Stein

Quantity Value Units Method Reference Comment
Δfsolid-637.56 ± 0.84kJ/molCcbHuffman, Fox, et al., 1937Author's hf298=-153.49 kcal/mol
Quantity Value Units Method Reference Comment
Δcsolid-3581.4 ± 0.84kJ/molCcbHuffman, Fox, et al., 1937Author's hf298=-153.49 kcal/mol

References

Huffman, Fox, et al., 1937
Huffman, H.M.; Fox, S.W.; Ellis, E.L., Thermal data. VII. The heats of combustion of seven amino acids, J. Am. Chem. Soc., 1937, 59, 2144-21. [all data]