Diethyl 2,4-dichlorophenyl phosphate

Kovats' RI, non-polar column, isothermal

Data compiled by: NIST Mass Spectrometry Data Center, William E. Wallace, director

Column type Capillary
Active phase OV-101
Column length (m) 30.
Carrier gas N2
Substrate
Column diameter (mm) 0.32
Phase thickness (μm)
Temperature (C) 200.
I 1837.
ReferenceGandhe, Purnanand, et al., 1990
Comment MSDC-RI

Kovats' RI, polar column, isothermal

Data compiled by: NIST Mass Spectrometry Data Center, William E. Wallace, director

Column type Capillary
Active phase DB-Wax
Column length (m) 30.
Carrier gas N2
Substrate
Column diameter (mm) 0.32
Phase thickness (μm)
Temperature (C) 200.
I 2490.
ReferenceGandhe, Purnanand, et al., 1990
Comment MSDC-RI

References

Gandhe, Purnanand, et al., 1990
Gandhe, B.R.; Purnanand; Prasad, R.; Danikhel, R.K.; Shinde, S.K.; Srivastava, R.K.; Batra, B.S.; Rao, K.M., Use of gas chromatographic retention indices for quantitative structure activity relationship studies of dialkyl phenyl phosphates, Pestic. Sci., 1990, 29, 4, 379-385, https://doi.org/10.1002/ps.2780290402 . [all data]