1,1,1-Pentanetricarboxylic acid, triethyl ester

Condensed phase thermochemistry data

Data compiled by: Hussein Y. Afeefy, Joel F. Liebman, and Stephen E. Stein

Quantity Value Units Method Reference Comment
Δfliquid-1343.2 ± 1.6kJ/molCcbRakus, Verevkin, et al., 1995
Quantity Value Units Method Reference Comment
Δcliquid-7595.8 ± 1.6kJ/molCcbRakus, Verevkin, et al., 1995Corresponding Δfliquid = -1343.3 kJ/mol (simple calculation by NIST; no Washburn corrections)

References

Rakus, Verevkin, et al., 1995
Rakus, K.; Verevkin, S.P.; Keller, M.; Beckhaus, H.-D.; Ruchardt, C., Radical stabilization enthalpies of α,α-bis(methoxycarbonyl)alkyl and tris(methoxycarbonyl)methyl radicals, Liebigs Ann. Chem., 1995, 1483-1493. [all data]