Benzenepropanoic acid, 3,5-bis(1,1-dimethylethyl)-4-hydroxy-, 2-[3-[3,5-bis(1,1-dimethylethyl)-4-hydroxyphenyl]-1-oxopropyl]hydrazide

Phase change data

Data compiled by: William E. Acree, Jr., James S. Chickos

Enthalpy of fusion

ΔfusH (kcal/mol) Temperature (K) Method Reference
9.92503.DSCCogen and Hilmer, 2008

References

Cogen and Hilmer, 2008
Cogen, Jeffrey M.; Hilmer, Andrew J., Crystal polymorphism in antioxidant-metal deactivator 1,2-bis(3,5-di-tert-butyl-4-hydroxyhydrocinnamoyl)hydrazine, Polymer Degradation and Stability, 2008, 93, 12, 2193-2198, https://doi.org/10.1016/j.polymdegradstab.2008.07.027 . [all data]