tert-butyl 2-butenoate

Gas phase thermochemistry data

Data compiled by: Hussein Y. Afeefy, Joel F. Liebman, and Stephen E. Stein

Quantity Value Units Method Reference Comment
Δfgas-424. ± 3.kJ/molCcbSchjanberg, 1936Heat of formation derived by Cox and Pilcher, 1970

References

Schjanberg, 1936
Schjanberg, E., Die verbrennungswarmen und die refraktionsdaten einiger crotonsaureeste, Z. Phys. Chem., 1936, 175, 289-342. [all data]

Cox and Pilcher, 1970
Cox, J.D.; Pilcher, G., Thermochemistry of Organic and Organometallic Compounds, Academic Press, New York, 1970, 1-636. [all data]