2,5-dibromofuran

Phase change data

Data compiled by: Thermodynamics Research Center, NIST Boulder Laboratories, Chris Muzny director

Quantity Value Units Method Reference Comment
Tfus278.15KN/AHenninger, 1886Uncertainty assigned by TRC = 3. K

In addition to the Thermodynamics Research Center (TRC) data available from this site, much more physical and chemical property data is available from the following TRC products:

References

Henninger, 1886
Henninger, A., Several Derivatives of Erythritol and Formates of Polyatomic Alcohols, Ann. Chim. Phys., 1886, [6] 7, 209. [all data]