β-Galactopyranose, TMS

Kovats' RI, non-polar column, isothermal

View large format table.

Column type Active phase Temperature (C) I Reference Comment
CapillarySE-54180.1941.Martinez-Castro, Paez, et al., 1989Supelcoport; Column length: 40. m; Column diameter: 0.18 mm
PackedSE-30210.1939.Saura-Calixto, Cañellas, et al., 1984N2, Supelcoport (80-100mesh); Column length: 3. m

Kovats' RI, polar column, isothermal

View large format table.

Column type Active phase Temperature (C) I Reference Comment
CapillaryCarbowax 20M160.1869.Martinez-Castro, Paez, et al., 1989Chrompack; Column length: 25. m; Column diameter: 0.22 mm

Normal alkane RI, non-polar column, temperature ramp

View large format table.

Column type Active phase I Reference Comment
CapillaryDB-11952.Frank, Meuleye, et al., 200760. m/0.32 mm/0.25 μm, Hydrogen, 4. K/min, 320. C @ 25. min; Tstart: 100. C

References

Martinez-Castro, Paez, et al., 1989
Martinez-Castro, I.; Paez, M.I.; Sanz, J.; Garcia-Raso, A., Gas Chromatographic Behaviour of Carbohydrate Trimethylsilyl Ethers. II. Aldohexoses, J. Chromatogr., 1989, 462, 49-60, https://doi.org/10.1016/S0021-9673(00)91335-9 . [all data]

Saura-Calixto, Cañellas, et al., 1984
Saura-Calixto, F.; Cañellas, J.; García-Raso, A., Gas chromatograph analysis of surgars and sugar-alcohols in the mesocarp, endocarp, and kernel of almond fruit, J. Agric. Food Chem., 1984, 32, 5, 1018-1020, https://doi.org/10.1021/jf00125a017 . [all data]

Frank, Meuleye, et al., 2007
Frank, T.; Meuleye, B.S.; Miller, A.; Shu, A.-Y.; Engel, K.-H., Metabolite profiling of two low phytic acid (Ipa) rice nutants, J. Agric. Food Chem., 2007, 55, 26, 11011-11019, https://doi.org/10.1021/jf0723559 . [all data]