α-D-Glactopyranose, 5TMS derivative

Kovats' RI, non-polar column, isothermal

Data compiled by: NIST Mass Spectrometry Data Center, William E. Wallace, director

Column type Capillary
Active phase SE-54
Column length (m) 40.
Carrier gas
Substrate Supelcoport
Column diameter (mm) 0.18
Phase thickness (μm)
Temperature (C) 180.
I 1894.
ReferenceMartinez-Castro, Paez, et al., 1989
Comment MSDC-RI

References

Martinez-Castro, Paez, et al., 1989
Martinez-Castro, I.; Paez, M.I.; Sanz, J.; Garcia-Raso, A., Gas Chromatographic Behaviour of Carbohydrate Trimethylsilyl Ethers. II. Aldohexoses, J. Chromatogr., 1989, 462, 49-60, https://doi.org/10.1016/S0021-9673(00)91335-9 . [all data]