Benzoic acid, 5-chloro-2-hydroxy-

Normal alkane RI, non-polar column, temperature ramp

Data compiled by: NIST Mass Spectrometry Data Center, William E. Wallace, director

Column type Capillary
Active phase SE-30
Column length (m) 20.
Carrier gas
Substrate
Column diameter (mm) 0.2
Phase thickness (μm)
Tstart (C) 100.
Tend (C) 230.
Heat rate (K/min) 4.
Initial hold (min)
Final hold (min)
I 1480.
ReferenceShakirov, Tsypysheva, et al., 1988
Comment MSDC-RI

References

Shakirov, Tsypysheva, et al., 1988
Shakirov, L.G.; Tsypysheva, L.G.; Suleimamova, R.A.; Naimushin, A.I.; Tsypyshev, O.Yu., Gas chromatographic determination of the products of the synthesis of chlorine-substituted salicylic acids, Zh. Anal. Khim., 1988, 43, 143-146. [all data]