Phosphoric acid, bis[2,3-bis[(trimethylsilyl)oxy]propyl] trimethylsilyl ester

Normal alkane RI, non-polar column, custom temperature program

Data compiled by: NIST Mass Spectrometry Data Center, William E. Wallace, director

Column type Capillary
Active phase Polydimethyl siloxane
Column length (m)
Carrier gas
Substrate
Column diameter (mm)
Phase thickness (μm)
Program not specified
I 2171.
ReferenceSupplemental Table S3, 2012
Comment MSDC-RI

References

Supplemental Table S3, 2012
Supplemental Table S3, Manually identified analytes present in all three independent not-lethal salt stress acclimation experiments, 2012, retrieved from www.plosone.org/article/fetchSingleRepresentation.action?uri. [all data]