4-Bromo-1-pentene

Phase change data

Data compiled by: Thermodynamics Research Center, NIST Boulder Laboratories, Chris Muzny director

Quantity Value Units Method Reference Comment
Tboil384.65KN/APetrov, Chel'tsova, et al., 1952Uncertainty assigned by TRC = 1.5 K

In addition to the Thermodynamics Research Center (TRC) data available from this site, much more physical and chemical property data is available from the following TRC products:

References

Petrov, Chel'tsova, et al., 1952
Petrov, A.D.; Chel'tsova, M.A.; Chernyshev, E.A., Behaviour of γ-Alkenyl Halides in the Grignard-Wurtz Synthesis, Izv. Akad. Nauk SSSR, 1952, 1952, 1087. [all data]