3,6-Dihydro-2H-pyran

Gas phase thermochemistry data

Data compiled by: Glushko Thermocenter, Russian Academy of Sciences, Moscow

Constant pressure heat capacity of gas

Cp,gas (J/mol*K) Temperature (K) Reference Comment
34.7050.Dorofeeva O.V., 1992p=1 bar.
41.92100.
51.69150.
63.94200.
86.22273.15
94.6 ± 3.5298.15
95.18300.
128.39400.
157.69500.
181.96600.
201.98700.
218.65800.
232.68900.
244.581000.
254.711100.
263.381200.
270.821300.
277.231400.
282.771500.

References

Dorofeeva O.V., 1992
Dorofeeva O.V., Ideal gas thermodynamic properties of oxygen heterocyclic compounds. Part 2. Six-membered, seven-membered and eight-membered rings, Thermochim. Acta, 1992, 200, 121-150. [all data]