Cyclopentadienylmanganesedicarbonylthiocarbonyl

Gas phase ion energetics data

Data compiled by: Sharon G. Lias, Rhoda D. Levin, and Sherif A. Kafafi

Ionization energy determinations

IE (eV) Method Reference Comment
7.78 ± 0.01EIEfraty, Huang, et al., 1975
7.81PELichtenberger and Fenske, 1976Vertical value

Appearance energy determinations

Ion AE (eV) Other Products MethodReferenceComment
C5H5Mn+12.25 ± 0.032CO+CSEIEfraty, Huang, et al., 1975
C5H9O2F9SiP3Mn+16.91 ± 0.022CO+C5H5EIEfraty, Huang, et al., 1975
C6H5SMn+9.25 ± 0.012COEIEfraty, Huang, et al., 1975
C7H5OSMn+8.18 ± 0.01COEIEfraty, Huang, et al., 1975
Mn+16.51 ± 0.042CO+CS+C5HEIEfraty, Huang, et al., 1975

References

Efraty, Huang, et al., 1975
Efraty, A.; Huang, M.H.A.; Weston, C.A., Mass spectra of organometallic compounds. V. Electron-impact study of the cyclopentadienylmanganese thiocarbonyl and carbonyl complexes RC5H4Mn(CO)2CX [R=H, CH3; X = S, O], Inorg. Chem., 1975, 14, 2796. [all data]

Lichtenberger and Fenske, 1976
Lichtenberger, D.L.; Fenske, R.F., Electronic structure of transition metal thiocarbonyl complexes, Inorg. Chem., 1976, 15, 2015. [all data]