Iron, tricarbonyl[(1,2,3,4-η)-2,3-dimethyl-1,3-butadiene]-

Gas phase ion energetics data

Data compiled by: Sharon G. Lias, Rhoda D. Levin, and Sherif A. Kafafi

Ionization energy determinations

IE (eV) Method Reference Comment
7.95PEWorley, Webb, et al., 1980Vertical value

References

Worley, Webb, et al., 1980
Worley, S.D.; Webb, T.R.; Gibson, D.H.; Ong, T.-S., The photoelectron spectra of some iron tricarbonyl complexes of 4π-electron donor ligands, J. Electron Spectrosc. Relat. Phenom., 1980, 18, 189. [all data]