Cyclopenta[c,d]pentalene, 2a,4a,7a,7b-tetrahydro-

Reaction thermochemistry data

Data compiled by: Hussein Y. Afeefy, Joel F. Liebman, and Stephen E. Stein

Individual Reactions

2Hydrogen + C10H12 = Perhydrotriquinacene

By formula: 2H2 + C10H12 = C10H16

Quantity Value Units Method Reference Comment
Δr-55.0 ± 0.4kcal/molChydLiebman, Paquette, et al., 1986liquid phase; solvent: Hexane

References

Liebman, Paquette, et al., 1986
Liebman, J.F.; Paquette, L.A.; Peterson, J.R.; Rogers, D.W., Is triquinacene homoaromatic? A thermochemical answer in the affirmative, J. Am. Chem. Soc., 1986, 108, 8267-8268. [all data]