3-Oxatricyclo[3.2.1.0(2,4)]octane, (1α,2β,4β,5α)-

Condensed phase thermochemistry data

Data compiled by: Hussein Y. Afeefy, Joel F. Liebman, and Stephen E. Stein

Quantity Value Units Method Reference Comment
Δfsolid-23.4 ± 0.60kcal/molCcbKozina, Timofeeva, et al., 1988See Timofeeva, Lukyanova, et al., 1984
Quantity Value Units Method Reference Comment
Δcsolid-976.51 ± 0.60kcal/molCcbKozina, Timofeeva, et al., 1988See Timofeeva, Lukyanova, et al., 1984; Corresponding Δfsolid = -23.4 kcal/mol (simple calculation by NIST; no Washburn corrections)

References

Kozina, Timofeeva, et al., 1988
Kozina, M.P.; Timofeeva, L.P.; Luk'Yanova, V.A.; Pimenova, S.M.; Kas'yan, L.I., Enthalpies of formation and some alicyclic epoxy compounds, Russ. J. Phys. Chem. (Engl. Transl.), 1988, 62, 609-612. [all data]

Timofeeva, Lukyanova, et al., 1984
Timofeeva, L.P.; Lukyanova, V.A.; Kozina, M.P.; Stepanova, N.V., Enthalpies of combustion and formation of some epoxides of cyclic alkenes, Probl. Kalorim. Khim. Termodin., Dokl. Vses. Konf., 10th, 1984, 1, 193-195. [all data]