1-Methyl-2-phenylcyclopropane

Phase change data

Data compiled as indicated in comments:
TRC - Thermodynamics Research Center, NIST Boulder Laboratories, Chris Muzny director
BS - Robert L. Brown and Stephen E. Stein

Quantity Value Units Method Reference Comment
Tboil461.KN/AHuang, Chung, et al., 1961Uncertainty assigned by TRC = 4. K; TRC

Reduced pressure boiling point

Tboil (K) Pressure (bar) Reference Comment
358. - 363.0.027Frinton Laboratories Inc., 1986BS

In addition to the Thermodynamics Research Center (TRC) data available from this site, much more physical and chemical property data is available from the following TRC products:

References

Huang, Chung, et al., 1961
Huang, M.L.; Chung, T.-S.; Ku, T.-S.; Chow, W.-Z., Modified Wolff-Kishner Method, Hua Hseuh Hseuh Pao, 1961, 27, 1-9. [all data]

Frinton Laboratories Inc., 1986
Frinton Laboratories Inc., Catalog Number 11, Frinton Laboratories Inc., Vineland, NJ, 1986, 99. [all data]