Methane sulfonamide

Reaction thermochemistry data

Data compiled by: John E. Bartmess

Individual Reactions

CH4NO2S- + Hydrogen cation = Methane sulfonamide

By formula: CH4NO2S- + H+ = CH5NO2S

Quantity Value Units Method Reference Comment
Δr345.9 ± 2.3kcal/molG+TSKoppel, Taft, et al., 1994gas phase
Quantity Value Units Method Reference Comment
Δr338.8 ± 2.0kcal/molIMREKoppel, Taft, et al., 1994gas phase

References

Koppel, Taft, et al., 1994
Koppel, I.A.; Taft, R.W.; Anvia, F.; Zhu, S.Z.; Hu, L.Q.; Sung, K.S.; Desmarteau, D.D.; Yagupolskii, L.M., The Gas-Phase Acidities of Very Strong Neutral Bronsted Acids, J. Am. Chem. Soc., 1994, 116, 7, 3047, https://doi.org/10.1021/ja00086a038 . [all data]