Tetrathiafulvalene

Condensed phase thermochemistry data

Data compiled by: Hussein Y. Afeefy, Joel F. Liebman, and Stephen E. Stein

Quantity Value Units Method Reference Comment
Δfsolid290.8 ± 1.7kJ/molCcrMetzger, 1977Heat of formation H2SO4.60H2O=-598.98kJ/mol
Quantity Value Units Method Reference Comment
Δcsolid-5619.5 ± 1.7kJ/molCcrMetzger, 1977Heat of formation H2SO4.60H2O=-598.98kJ/mol

References

Metzger, 1977
Metzger, R.M., The enthalpy of formation and the experimental crystal binding energy of tetrathiofulvalenium 7,7,8,8-tetracyanoquinodimethanide (TTF TCNQ), J. Chem. Phys., 1977, 66, 2525-2533. [all data]