4,4-dimethyl-1-pentanol

Phase change data

Data compiled by: Thermodynamics Research Center, NIST Boulder Laboratories, Chris Muzny director

Quantity Value Units Method Reference Comment
Tboil433.15KN/AMalinovskii, Volkova, et al., 1949Uncertainty assigned by TRC = 4. K

In addition to the Thermodynamics Research Center (TRC) data available from this site, much more physical and chemical property data is available from the following TRC products:

References

Malinovskii, Volkova, et al., 1949
Malinovskii, M.S.; Volkova, E.E.; Morozova, N.M., The production of alcohols from olefin oxides: II the synthesis of 2,2- dimethylbutanol-4 and 2,2-dimethylpentanol-5 from ethylene oxide and heptanol-6, and of 2-methylhexanol-2 from propylene oxide, Zh. Obshch. Khim., 1949, 19, 114-7. [all data]