Bicyclo[2.2.1]heptane-2,5-dione,1,3,3-trimethyl-

Gas phase ion energetics data

Data compiled as indicated in comments:
LLK - Sharon G. Lias, Rhoda D. Levin, and Sherif A. Kafafi

Ionization energy determinations

IE (eV) Method Reference Comment
9.1PEFrost, Westwood, et al., 1980LLK
9.24PEFrost, Westwood, et al., 1980Vertical value; LLK

References

Frost, Westwood, et al., 1980
Frost, D.C.; Westwood, N.P.C.; Werstiuk, N.H., Ultraviolet photoelectron spectra of 2-norbornanone, 2,5-norbornanedione. Their akyl derivatives and thio-analogues. An investigation of transannular interactions by photoelectron spectroscopy, Can. J. Chem., 1980, 58, 1659. [all data]